program: Gaussian 09
title: 000235568
version: EM64L-G09RevD.01
frameworkgroup: C1[X(C14H9IO3)]
method: RPBEPBE
basis: SDD
operation: Freq
keyword: #p
keyword: freq=noraman
keyword: PBEPBE/SDD
title: #p freq=noraman PBEPBE/SDD
converged: YES YES NO NO
title: Mulliken charges:
elementType: I O O O C C C C C C C C C C C C C C H H H H H H H H H
charge: 0.114508 -0.198921 -0.436173 -0.231439 0.249937 0.357924 0.003185 0.097940 -0.361178 -0.332381 -0.345004 -0.340426 -0.222795 -0.220247 -0.160939 -0.160661 -0.360682 0.089186 0.265746 0.282751 0.253191 0.280206 0.240573 0.239883 0.251873 0.253814 0.390129
chargesum: 0.00000
title: Mulliken charges with hydrogens summed into heavy atoms:
elementType: I O O O C C C C C C C C C C C C C C
charge: 0.114508 -0.198921 -0.046043 -0.231439 0.249937 0.357924 0.003185 0.097940 -0.095432 -0.049630 -0.091813 -0.060220 0.017777 0.019635 0.090934 0.093153 -0.360682 0.089186
polarizability: 2.78167604e+02 -1.37181352e+01 1.50159421e+02 -2.66210263e+01 -1.17979715e+01 1.38211770e+02
1716.lowfreq: -6.1075 -3.2603 -0.0004 0.0004 0.0005 5.0833 15.6336 39.8666 48.7370
frequency: 15.3686 39.8520 48.7352 58.3695 93.3847 114.1490 126.2000 152.1871 194.5670 213.6597 251.5128 264.4839 302.7792 349.1436 384.1074 403.1014 412.5551 458.9665 471.6653 506.6735 573.6132 590.9178 597.8451 620.2922 641.2511 671.9714 691.1572 707.0802 733.3289 764.7851 782.0678 791.9451 838.3437 854.3878 894.2162 917.1517 969.7946 976.3109 989.9898 993.4308 1004.0269 1006.3990 1040.7826 1051.9759 1100.4098 1111.8604 1152.2108 1162.7457 1179.1421 1189.4878 1258.9082 1285.9809 1294.7501 1321.7301 1363.5407 1378.9186 1389.4103 1427.4967 1464.4443 1474.4178 1545.0803 1573.3747 1577.4921 1590.7771 1601.2074 1635.6090 3138.0564 3141.6002 3152.6645 3154.2107 3166.0526 3169.5450 3174.7398 3181.1580 3531.5293
redmass: 7.6662 5.4362 5.2440 9.5613 9.6913 5.0955 8.6248 8.7298 8.3544 6.5378 6.4089 5.8312 7.1954 6.2418 7.1288 2.8879 3.2101 4.8667 4.7952 5.1985 4.5058 1.4509 3.1111 7.1126 5.9759 4.5530 3.7606 6.2032 3.2279 4.1345 2.8080 2.0006 1.3188 1.5903 1.6631 4.0655 1.3604 1.4084 1.7865 2.8077 3.7322 1.5123 2.4372 2.4870 2.1966 1.3902 2.2701 1.7586 1.0742 1.1609 2.1849 2.0141 1.2678 2.6436 5.0876 10.4149 3.9167 2.1900 2.3215 2.6688 10.2291 7.1782 7.4629 6.5673 6.3041 8.7709 1.0864 1.0889 1.0911 1.0884 1.0968 1.0958 1.0974 1.0977 1.0643
irintensity: 0.2295 0.5228 1.1589 0.7663 2.9413 0.6192 1.2299 0.9082 1.3835 5.9813 2.8134 2.0382 0.7280 13.3275 11.2354 1.2281 9.0207 16.1740 5.0839 22.4924 2.3483 93.4138 40.0273 1.2348 10.6339 9.0915 77.6431 8.5133 57.4184 28.0305 21.8193 21.3997 7.3390 32.7368 20.1376 89.6989 0.0880 3.6795 24.4276 34.6665 202.7317 31.5431 6.2794 29.9626 69.9765 6.7861 9.5993 72.6945 0.5775 18.3005 126.5149 131.3331 6.6793 83.5042 16.3609 12.0498 21.4930 9.3657 21.0610 7.3187 183.8128 35.7274 63.4015 84.2457 11.2172 251.3172 1.8413 4.2147 8.9308 0.3686 13.4544 7.3662 2.2415 10.1158 52.8373
temp: 298.150 k
press: 1.00000 atm
elementType: 53 8 8 8 6 6 6 6 6 6 6 6 6 6 6 6 6 6 1 1 1 1 1 1 1 1 1
symmnumber: 1
zpe: 499160.3 jmol-1
zpe.correction: 0.190120 hartree
zpe.thermalcorrener: 0.205899 hartree
zpe.thermalcorrenthalpy: 0.206844 hartree
zpe.thermalcorrgfe: 0.143243 hartree
zpe.sumelectzpe: -774.832728 hartree
zpe.sumelectthermal: -774.816949 hartree
zpe.sumelectthermalent: -774.816004 hartree
zpe.sumelectthermalfe: -774.879605 hartree
dipole: 1.7834 2.1836 -3.1255
dipole: 4.2092
quadrupole: -105.3721 -113.3106 -116.5346
quadrupole: 6.5773 -14.3471 6.0614
quadrupole: 6.3670 -1.5715 -4.7955 6.5773 -14.3471 6.0614
hfenergy: -775.0228481 hartree
pointgroup: C01 [X(C14H9I1O3)]
dipole: 0.9061518 -0.401749 -1.3266217 debye
polarizability: 273.5961632|-36.2324629|135.5428977|11.7682466|-9.8918592|157.3997339 unknown
InChI: InChI=1S/C14H9IO3/c15-10-7-5-9(6-8-10)13(16)11-3-1-2-4-12(11)14(17)18/h1-8,17H
charge 0 multiplicity 1
27 atoms
I  -5.620228 0.223626 -1.556419
O  0.199204 -0.387621 2.613082
O  2.012225 2.450678 -1.480566
O  0.543616 2.188495 0.296029
C  1.392606 -0.618622 0.53889
C  -1.178299 -0.209891 0.638688
C  0.132277 -0.358342 1.34879
C  1.986877 0.324618 -0.351794
C  2.012324 -1.880238 0.710138
C  3.158496 -0.021158 -1.074796
C  -1.330316 -0.510542 -0.739222
C  -2.311714 0.206255 1.385263
C  3.176347 -2.219968 -0.013737
C  3.746411 -1.291718 -0.916024
C  -2.589269 -0.395069 -1.366917
C  -3.5723 0.333287 0.771501
C  -3.699827 0.031115 -0.605254
C  1.426955 1.700137 -0.448977
H  1.573644 -2.592305 1.416456
H  3.600926 0.722849 -1.742467
H  -0.47132 -0.848475 -1.329023
H  -2.182626 0.431773 2.448694
H  3.63705 -3.203395 0.128816
H  4.650004 -1.551258 -1.477263
H  -2.700271 -0.634396 -2.428132
H  -4.438556 0.663175 1.351787
H  1.615866 3.362987 -1.474945
