program: Gaussian 09
title: 000235567
version: EM64L-G09RevD.01
frameworkgroup: C1[X(C14H8Br2O3)]
method: RPBEPBE
basis: SDD
operation: Freq
keyword: #p
keyword: freq=noraman
keyword: PBEPBE/SDD
title: #p freq=noraman PBEPBE/SDD
converged: YES YES NO NO
title: Mulliken charges:
elementType: Br Br O O O C C C C C C C C C C C C C C H H H H H H H H
charge: 0.024086 0.024079 -0.352542 -0.171487 -0.171622 0.251885 0.251915 -0.269995 -0.270038 -0.334599 -0.334505 0.189817 0.189949 -0.189055 -0.189069 -0.206824 -0.206843 -0.185204 -0.185199 0.286030 0.286043 0.276921 0.276915 0.245535 0.245537 0.259136 0.259132
chargesum: 0.00000
title: Mulliken charges with hydrogens summed into heavy atoms:
elementType: Br Br O O O C C C C C C C C C C C C C C
charge: 0.024086 0.024079 -0.352542 -0.171487 -0.171622 0.251885 0.251915 0.016035 0.016005 -0.057678 -0.057590 0.189817 0.189949 -0.189055 -0.189069 0.038711 0.038694 0.073933 0.073933
polarizability: 2.43437444e+02 9.39948042e-02 2.27934574e+02 -3.04370020e+01 1.10157318e-02 1.18124806e+02
1716.lowfreq: -7.1966 -4.9085 -2.4894 -0.0006 -0.0001 0.0003 9.9364 22.6169 23.5688
frequency: 9.8552 22.5726 23.5685 56.8678 69.1725 107.2976 138.3710 158.1372 175.5342 181.4586 182.7873 215.3654 268.8557 283.9915 284.6408 304.7985 356.6058 420.7505 421.5766 449.0587 481.1842 481.3019 512.9121 601.5652 641.4326 650.8205 660.3226 668.3701 697.0468 716.5703 733.5809 783.3331 794.8068 812.9749 817.0885 917.4070 921.6307 941.6538 943.1928 958.3407 974.5685 986.0947 986.7143 1000.1920 1000.2091 1064.7224 1065.3974 1100.9717 1101.1024 1173.0906 1180.4292 1192.7461 1245.9482 1285.6157 1289.1803 1381.8671 1381.8799 1408.2675 1408.7016 1455.2614 1457.6018 1566.8023 1567.4336 1597.8319 1598.2220 1632.2074 1689.9976 3149.5176 3149.5446 3167.1819 3167.2157 3178.9280 3178.9845 3189.2888 3189.5868
redmass: 20.8429 6.1675 8.4197 14.7892 11.7170 9.6584 6.0133 7.1201 12.3582 4.6560 4.7126 8.6323 8.3938 13.4974 8.3060 5.5110 9.5355 3.2226 3.1102 6.8161 5.4529 5.3083 7.7244 9.3218 7.1424 7.5850 5.0585 3.6702 3.0645 2.8990 5.4452 4.6638 6.3308 1.6177 1.7939 1.4447 1.4291 1.4362 1.4264 7.8193 7.3914 5.8156 5.3455 1.3614 1.3607 2.1982 2.1298 1.5661 1.5777 1.3825 1.0843 1.9999 2.9794 1.3070 1.4147 10.6221 10.6107 2.7496 2.7625 2.3162 2.3923 6.8464 6.8069 6.4999 6.5174 12.8199 12.8158 1.0875 1.0875 1.0930 1.0930 1.0991 1.0991 1.0932 1.0931
irintensity: 0.0061 2.3260 0.5588 1.8328 0.3693 1.0026 0.0673 0.0392 0.0718 0.1271 1.0824 0.0819 6.3121 3.8739 1.1783 0.4018 6.9835 1.4251 2.8605 0.8462 11.4129 1.8386 7.8358 22.0273 8.1682 11.4788 13.7779 15.5853 0.6094 146.6439 70.7860 3.4587 76.9492 48.1871 8.1166 17.5350 2.0599 51.1139 0.9625 1315.4803 34.4350 127.9557 0.0128 1.4377 0.8606 9.9746 23.9126 3.6221 27.9723 232.6626 0.9283 351.3874 56.7143 7.7643 0.4961 2.9644 2.2832 21.7845 23.2695 16.7318 31.7580 32.6462 98.2745 13.9352 0.5954 90.5968 335.4536 4.9032 3.3435 0.3472 0.3715 17.2805 1.2951 0.0034 2.8311
temp: 298.150 k
press: 1.00000 atm
elementType: 35 35 8 8 8 6 6 6 6 6 6 6 6 6 6 6 6 6 6 1 1 1 1 1 1 1 1
symmnumber: 1
zpe: 472705.0 jmol-1
zpe.correction: 0.180044 hartree
zpe.thermalcorrener: 0.197179 hartree
zpe.thermalcorrenthalpy: 0.198123 hartree
zpe.thermalcorrgfe: 0.129680 hartree
zpe.sumelectzpe: -789.576052 hartree
zpe.sumelectthermal: -789.558917 hartree
zpe.sumelectthermalent: -789.557973 hartree
zpe.sumelectthermalfe: -789.626415 hartree
dipole: -0.0009 -1.4837 0.0020
dipole: 1.4837
quadrupole: -94.3050 -144.3816 -127.6023
quadrupole: -0.0026 -13.9867 0.0019
quadrupole: 27.7913 -22.2853 -5.5060 -0.0026 -13.9867 0.0019
hfenergy: -789.7560959 hartree
pointgroup: C01[X(C14H8Br2O3)]
dipole: -0.0016657 0.5837012 -0.0055129 debye
polarizability: 249.3395161|0.0535537|227.9273506|12.3292069|-0.8971625|112.2299568 unknown
InChI: InChI=1S/C14H8Br2O3/c15-11-5-1-3-9(7-11)13(17)19-14(18)10-4-2-6-12(16)8-10/h1-8H
charge 0 multiplicity 1
27 atoms
Br -3.554168 3.182971 1.417358
Br 3.533872 3.176656 -1.463675
O  -0.000557 -0.637131 0.009309
O  -1.098085 -2.473167 -0.972945
O  1.107113 -2.453101 1.017294
C  -2.395946 -0.527053 -0.285629
C  2.394815 -0.511359 0.298989
C  -2.371998 0.72875 0.376201
C  2.364122 0.734109 -0.381849
C  -3.61177 -1.040495 -0.808564
C  3.614126 -1.012193 0.826007
C  -1.166031 -1.349031 -0.450332
C  1.168585 -1.335343 0.480374
C  -3.573734 1.44827 0.502413
C  3.562715 1.456182 -0.522471
C  -4.8009 -0.299052 -0.668979
C  4.79999 -0.268477 0.671687
C  -4.792418 0.954819 -0.011442
C  4.784764 0.975229 -0.004766
H  -1.432672 1.115097 0.77729
H  1.422173 1.110725 -0.786031
H  -3.601503 -2.012527 -1.311438
H  3.608989 -1.976396 1.343802
H  -5.74263 -0.688383 -1.068398
H  5.744357 -0.648068 1.074235
H  -5.71482 1.532399 0.098208
H  5.70461 1.554572 -0.125948
