program: Gaussian 09
title: 000235565
version: EM64L-G09RevD.01
frameworkgroup: C1[X(C14H7FO2)]
method: RPBEPBE
basis: SDD
operation: Freq
keyword: #p
keyword: freq=noraman
keyword: PBEPBE/SDD
title: #p freq=noraman PBEPBE/SDD
converged: YES YES YES YES
title: Mulliken charges:
elementType: F O O C C C C C C C C C C C C C C H H H H H H H
charge: -0.188394 -0.187718 -0.191898 0.281096 0.278824 0.261774 0.270987 -0.203092 -0.207443 -0.519660 -0.338826 -0.365394 -0.367095 0.351785 -0.375439 -0.224718 -0.223310 0.315822 0.294329 0.291326 0.291460 0.269388 0.243227 0.242971
chargesum: 0.00000
title: Mulliken charges with hydrogens summed into heavy atoms:
elementType: F O O C C C C C C C C C C C C C C
charge: -0.188394 -0.187718 -0.191898 0.281096 0.278824 0.261774 0.270987 -0.203092 -0.207443 -0.203838 -0.044498 -0.074068 -0.075635 0.351785 -0.106051 0.018509 0.019660
polarizability: 2.49749068e+02 -2.54310699e+00 1.76273207e+02 1.22101073e-02 7.05986254e-03 5.76490392e+01
1716.lowfreq: -10.0119 -0.0009 0.0006 0.0009 5.2390 11.4909 46.8587 96.9845 125.0211
frequency: 46.8562 96.9844 125.0195 148.2323 184.4624 200.6841 270.9374 299.7386 320.6820 372.2036 382.6197 407.8539 426.7943 441.3199 449.9175 463.9336 542.1317 559.7442 628.3469 650.1255 657.9207 678.7715 722.0868 726.0647 730.8806 807.7755 835.6839 842.6092 875.9951 917.1558 921.3089 948.0930 972.6627 992.1125 1000.9632 1017.3272 1034.5230 1076.1372 1089.7969 1135.9789 1161.6833 1173.4364 1201.2960 1221.6114 1255.4978 1289.8996 1307.0735 1391.4403 1403.7482 1419.2876 1442.7406 1470.4278 1474.0665 1538.8173 1550.4232 1574.2744 1600.3649 1603.8362 1619.2290 3138.9703 3152.9477 3161.7649 3163.2547 3173.1339 3175.1289 3182.4279
redmass: 8.9559 5.7037 5.5089 7.3238 7.8894 6.0010 7.1644 6.4199 9.7686 10.6170 8.6727 3.4889 6.5576 4.3017 3.5305 12.7030 4.4745 7.4737 6.9918 7.1060 3.7439 6.6206 3.8957 7.7613 2.4909 1.7272 7.0418 1.6124 1.9802 6.9265 1.4294 2.1109 3.8426 1.3794 1.4006 1.3746 1.9805 2.8477 1.9533 1.6050 1.9597 1.1146 3.8261 1.7434 1.5047 2.1760 4.9446 10.0553 8.3526 4.6378 2.7433 2.6695 3.1746 10.5570 9.5114 7.6413 6.4600 8.8148 7.5852 1.0864 1.0901 1.0894 1.0947 1.1003 1.0931 1.0972
irintensity: 4.2111 3.3087 0.7420 1.7994 0.1229 0.2474 0.9358 0.2892 0.0335 15.5381 9.5252 1.4160 1.8036 0.2535 0.5843 1.1231 6.0233 17.2301 6.2656 3.3414 8.1485 0.6175 12.5332 14.1913 73.0750 12.6721 27.8756 24.0425 22.6780 45.3556 22.2446 3.1088 2.0477 0.4835 6.1593 0.0008 1.9982 1.8596 4.3760 15.6705 12.9016 1.9230 19.1099 0.5497 10.8127 55.1444 710.0487 5.0783 8.3317 15.2784 2.0371 8.3853 8.4807 7.9269 309.6702 21.5276 27.0871 2.5428 22.4490 3.4989 3.7321 0.3762 1.1927 30.6703 3.4978 3.6172
temp: 298.150 k
press: 1.00000 atm
elementType: 9 8 8 6 6 6 6 6 6 6 6 6 6 6 6 6 6 1 1 1 1 1 1 1
symmnumber: 1
zpe: 441716.4 jmol-1
zpe.correction: 0.168241 hartree
zpe.thermalcorrener: 0.180503 hartree
zpe.thermalcorrenthalpy: 0.181447 hartree
zpe.thermalcorrgfe: 0.129417 hartree
zpe.sumelectzpe: -786.863154 hartree
zpe.sumelectthermal: -786.850892 hartree
zpe.sumelectthermalent: -786.849948 hartree
zpe.sumelectthermalfe: -786.901978 hartree
dipole: 2.1797 0.7484 -0.0003
dipole: 2.3046
quadrupole: -80.1167 -104.7469 -98.0104
quadrupole: -8.3335 -0.0001 -0.0048
quadrupole: 14.1746 -10.4556 -3.7191 -8.3335 -0.0001 -0.0048
hfenergy: -787.0313949 hartree
pointgroup: C01 [X(C14H7F1O2)]
dipole: -0.8545452 0.3030659 0.0001034 debye
dipolederiv: -1.198969 0.3250186 -0.0001079 0.4495871 -0.3334248 0.000045 -0.0001108 0.0000419 -0.1469498 -0.6746563 0.0283203 -0.0000134 0.0626459 -0.9129601 -0.0000975 -0.0000549 0.0001479 -0.3069772 -0.6823315 0.0192845 -0.0000223 0.0487075 -0.9371043 0.0000158 -0.0000462 0.0002032 -0.3095707 -0.3567833 -0.321104 0.0000214 -0.4617883 -0.0713614 0.0000197 0.0000341 -0.000068 0.0176569 -0.7197171 0.1863618 -0.0001187 0.3354179 -0.1456558 0.0000942 -0.0001116 0.0000095 0.0113324 -0.6337831 0.2014734 -0.0000828 0.3747268 -0.0652696 0.000065 -0.0001414 -0.0000229 0.0194809 -0.4975667 -0.2644014 0.0000245 -0.4620642 -0.1609011 0.0000611 0.0000689 -0.0000198 0.0248571 1.6707107 0.0434682 0.0000889 0.0188895 0.9521315 -0.0000132 0.0001581 -0.0000821 0.1350466 1.7484334 0.0413953 0.0001173 0.0176586 0.9586375 -0.0001695 0.0001114 -0.0001685 0.1319316 -0.4384759 0.196697 -0.0000341 -0.2235964 0.0092927 -0.0000003 -0.0000494 0.0000312 -0.1070346 0.0494004 -0.1085705 0.0000032 0.0751391 0.1163966 0.0000174 -0.0000109 -0.000012 -0.0904868 -0.1558712 -0.1643465 -0.000006 0.098643 0.0895299 0.0000171 -0.0000029 0.0000021 -0.1012034 -0.1799697 0.113798 0.0000027 -0.1405694 0.0954115 0.0000068 0.0000258 0.0000011 -0.1036339 1.4225667 -0.4142302 0.000142 -0.4616921 0.3689709 -0.0000495 0.0001733 -0.0000566 0.1063639 -0.0763539 0.109734 0.0000125 0.2719438 -0.1541991 0.0000189 -0.0000042 0.0000076 -0.1461736 0.1416807 0.1641894 -0.0000049 0.0989086 -0.0279853 -0.0000079 -0.0000187 -0.0000113 -0.1370147 0.1885534 -0.1261225 0.0000059 -0.0640778 -0.0519581 -0.0000103 0.0000205 -0.0000077 -0.135204 0.1476164 -0.0248445 -0.0000052 0.0425723 0.063305 -0.0000006 -0.0000404 -0.0000094 0.1777253 0.1327462 0.0444004 -0.0000012 -0.0242742 0.0195461 -0.0000074 0.0000443 0.0000065 0.1544128 0.1280342 0.0455162 0.0000027 -0.0216389 0.0053933 -0.0000031 0.0000436 0.0000004 0.1559532 0.1328915 -0.025847 -0.0000002 0.0421257 0.0050255 -0.0000027 -0.0000541 -0.0000047 0.1559172 -0.0042349 -0.0510754 -0.0000188 -0.0570657 0.0769425 -0.0000044 -0.0000325 -0.0000026 0.179261 -0.0583307 -0.0839817 0.0000007 -0.0981905 0.0369384 0.000002 -0.0000095 0.0000068 0.1572981 -0.0855903 0.0648667 -0.0000061 0.0779917 0.0632983 0.0000033 0.0000075 0.0000074 0.1570117 unknown
polarizability: 249.7927585|1.8042396|176.2295162|0.0121385|-0.0071822|57.6490392 unknown
InChI: InChI=1S/C14H7FO2/c15-8-5-6-11-12(7-8)14(17)10-4-2-1-3-9(10)13(11)16/h1-7H
charge 0 multiplicity 1
24 atoms
F  4.718065 -0.925676 0.000297
O  -0.063366 -2.694789 0.000098
O  -0.514168 2.809042 -0.000736
C  1.040319 -0.548784 -0.000102
C  0.924297 0.873067 -0.000122
C  -1.509044 -0.758806 -0.000258
C  -1.623722 0.663274 -0.000287
C  -0.173536 -1.428533 -0.000356
C  -0.412225 1.540737 -0.000157
C  2.317565 -1.157342 0.000044
C  2.095645 1.672719 -0.000027
C  -2.679195 -1.558047 -0.000243
C  -2.907211 1.262665 -0.000338
C  3.447385 -0.329845 0.000159
C  3.370732 1.078615 0.000127
C  -3.951825 -0.953232 -0.000272
C  -4.065946 0.460482 -0.000321
H  2.400741 -2.247852 0.000026
H  1.978633 2.760541 -0.00005
H  -2.561952 -2.646303 -0.000248
H  -2.966655 2.355585 -0.000361
H  4.287421 1.674804 0.000229
H  -4.853427 -1.574728 -0.000267
H  -5.055833 0.928808 -0.000335
