program: Gaussian 09
title: 000235564
version: EM64L-G09RevD.01
frameworkgroup: C1[X(C14H6Cl2O2)]
method: RPBEPBE
basis: SDD
operation: Freq
keyword: #p
keyword: freq=noraman
keyword: PBEPBE/SDD
title: #p freq=noraman PBEPBE/SDD
converged: NO YES NO YES
title: Mulliken charges:
elementType: Cl Cl O O C C C C C C C C C C C C C C H H H H H H
charge: -0.021989 -0.021989 -0.184864 -0.184865 0.271130 0.271131 0.280338 0.280340 -0.206019 -0.206016 -0.325216 -0.325216 -0.359179 -0.359179 -0.120110 -0.120110 -0.212523 -0.212523 0.313202 0.313202 0.295850 0.295850 0.269378 0.269378
chargesum: 0.00000
title: Mulliken charges with hydrogens summed into heavy atoms:
elementType: Cl Cl O O C C C C C C C C C C C C C C
charge: -0.021989 -0.021989 -0.184864 -0.184865 0.271130 0.271131 0.280338 0.280340 -0.206019 -0.206016 -0.012014 -0.012014 -0.063329 -0.063329 -0.120110 -0.120110 0.056855 0.056855
polarizability: 3.28291282e+02 6.16146549e+00 1.85352340e+02 5.99211761e-04 -7.23597211e-04 6.22613957e+01
1716.lowfreq: 0.0010 0.0016 0.0027 4.9210 5.3357 13.4748 32.9277 85.4699 92.6597
frequency: 32.9277 85.4699 92.6586 118.9802 138.6260 162.4030 176.2526 241.0521 257.5628 293.4619 299.8608 342.1023 346.7951 404.8546 414.3079 432.5031 444.2546 460.5156 469.6536 536.9211 543.1765 638.2504 653.6149 656.4475 678.1889 701.8298 712.4774 747.9298 809.6205 833.6833 860.0750 885.5721 932.7340 936.1352 949.0978 950.5316 994.8690 994.9511 1063.3311 1069.5203 1094.5928 1107.0855 1162.6296 1171.8479 1218.8287 1248.2646 1268.4849 1296.8949 1375.8493 1394.5716 1396.3629 1414.8766 1461.1848 1461.9011 1534.7041 1543.9016 1558.8346 1586.4689 1593.4262 1608.8494 3159.3021 3159.4524 3169.2682 3169.4458 3177.9288 3178.2149
redmass: 19.0549 6.5012 10.2664 15.9473 6.3521 6.0247 15.7514 7.6006 16.2719 6.2614 9.0232 7.1011 9.6287 7.1727 3.2917 10.1124 3.3412 12.1982 7.0222 4.4826 8.2651 7.5064 4.1964 7.4605 7.1382 8.1773 4.2592 4.8872 7.5780 1.5533 1.4712 2.1791 7.6349 1.4363 5.6698 1.8673 1.4087 1.3762 2.1295 2.0400 3.0689 1.8485 1.5637 3.3392 1.6060 1.3585 1.8700 4.4199 6.2283 9.2143 5.1721 5.5358 2.7390 2.9324 11.1536 10.0877 8.4969 6.7093 9.9562 8.1452 1.0890 1.0890 1.0927 1.0926 1.0973 1.0973
irintensity: 0.6208 6.8648 0.0000 0.2140 1.6687 0.0000 0.0000 0.1459 0.0000 0.0000 0.4738 0.0000 5.7571 0.0000 4.7238 68.2115 0.0003 0.0000 0.0000 23.1057 0.0001 3.0803 0.0039 41.0161 0.0000 0.0000 6.1240 37.1448 110.4277 0.0000 53.2172 0.0000 0.0001 29.0359 10.6702 0.0004 0.0001 4.6164 14.1328 0.0000 46.5504 0.0000 60.0013 0.0000 0.0000 45.2076 0.0000 862.9957 37.3928 0.0000 12.5430 0.0000 0.0000 3.3355 0.0000 375.8158 58.3247 0.0000 0.0000 65.1235 1.0174 0.0000 8.9194 0.0000 6.0664 0.0000
temp: 298.150 k
press: 1.00000 atm
elementType: 17 17 8 8 6 6 6 6 6 6 6 6 6 6 6 6 6 6 1 1 1 1 1 1
symmnumber: 1
zpe: 411972.2 jmol-1
zpe.correction: 0.156912 hartree
zpe.thermalcorrener: 0.170939 hartree
zpe.thermalcorrenthalpy: 0.171883 hartree
zpe.thermalcorrgfe: 0.114981 hartree
zpe.sumelectzpe: -1606.470906 hartree
zpe.sumelectthermal: -1606.456879 hartree
zpe.sumelectthermalent: -1606.455935 hartree
zpe.sumelectthermalfe: -1606.512837 hartree
dipole: 0.0000 0.0000 -0.0022
dipole: 0.0022
quadrupole: -114.4114 -120.3608 -117.5182
quadrupole: -13.1444 -0.0001 -0.0018
quadrupole: 3.0188 -2.9306 -0.0881 -13.1444 -0.0001 -0.0018
hfenergy: -1606.6278181 hartree
pointgroup: C01 [X(C14H6Cl2O2)]
dipole: -0.0000003 -0.0000052 -0.0008688 debye
dipolederiv: -0.9685652 -0.2249298 -0.00014 -0.3129702 -0.1769346 -0.0000489 -0.0001858 -0.0000427 -0.0468325 -0.9685641 -0.2249297 0.0001352 -0.3129694 -0.1769345 0.0000448 0.0001694 0.000043 -0.0468329 -0.7334691 -0.0539164 0.0000332 -0.1105809 -0.9098429 0.0001774 0.0000649 0.0002591 -0.304124 -0.7334702 -0.0539166 -0.0000515 -0.110582 -0.9098451 -0.0003164 -0.000006 -0.0001084 -0.3041252 -0.336428 0.2929296 -0.0000369 0.5975023 -0.1317601 0.0001502 0.0000419 0.0000434 0.0252615 -0.336433 0.2929302 0.0000014 0.5975004 -0.1317609 -0.0000783 -0.0000914 -0.0000858 0.0252608 -0.8679367 -0.1959328 -0.0000676 -0.3363266 -0.0881117 -0.0000545 0.0000394 -0.0000774 0.0120761 -0.8679341 -0.1959316 0.0001327 -0.3363238 -0.0881104 0.0001193 0.0000617 0.0000505 0.012077 1.8580271 -0.0371807 -0.0000949 -0.0562049 0.9598024 -0.0003928 -0.0001032 -0.0002669 0.1354169 1.8580318 -0.03718 0.0000786 -0.0562037 0.9598051 0.0003868 -0.0000058 0.00019 0.1354181 -0.562068 -0.1653084 -0.0000902 0.1403677 0.0115277 0.0000412 -0.0001383 -0.0000118 -0.0562902 -0.5620645 -0.1653093 0.0000792 0.1403665 0.011528 -0.0000151 0.0001539 0.0000264 -0.0562901 0.0611945 0.1843466 0.0000277 -0.1323248 0.0890169 -0.0000159 -0.0000308 0.0000342 -0.0908755 0.061194 0.1843462 -0.0000028 -0.132325 0.0890171 0.0000406 0.0000314 -0.0000184 -0.0908753 1.5237543 0.4058356 0.0002615 0.4404292 0.2105442 0.0000537 0.0002842 0.0000621 -0.0626021 1.5237528 0.4058357 -0.0002532 0.4404312 0.2105433 -0.0000532 -0.000311 -0.0000609 -0.062602 -0.244212 -0.2274476 -0.0000118 -0.2526662 -0.1162533 -0.0000403 -0.0000415 -0.0000337 -0.0924211 -0.2442126 -0.2274472 0.0000014 -0.2526663 -0.1162533 0.0000268 0.0000413 0.0000229 -0.0924209 0.1519042 0.0153574 -0.0000099 -0.0474469 0.0619593 -0.0000219 0.000058 -0.0000053 0.1612489 0.1519045 0.0153576 0.0000116 -0.0474467 0.0619594 0.0000112 -0.000002 -0.0000126 0.1612488 0.1145415 -0.0552207 -0.0000116 0.016199 0.0241008 0.0000098 -0.000009 -0.0000154 0.1556761 0.1145412 -0.0552205 0.0000065 0.0161988 0.0241011 -0.0000219 -0.0000428 0.0000075 0.1556762 0.0032556 0.0614664 -0.0000278 0.054021 0.0659506 0.0000097 -0.000011 0.0000143 0.1634656 0.0032561 0.0614661 0.0000294 0.0540211 0.0659506 -0.0000123 0.0000325 -0.0000141 0.1634657 unknown
polarizability: 326.9204121|15.2326973|186.7232099|-0.0006443|0.0006838|62.2613957 unknown
InChI: InChI=1S/C14H6Cl2O2/c15-7-1-3-9-11(5-7)14(18)10-4-2-8(16)6-12(10)13(9)17/h1-6H
charge 0 multiplicity 1
24 atoms
Cl -5.46207 -0.791297 -0.00054
Cl 5.462104 0.791305 -0.000539
O  -0.41746 -2.731334 0.001112
O  0.417493 2.731342 0.000913
C  -1.37009 -0.510572 0.000232
C  1.370123 0.510581 0.00025
C  -1.154403 0.899188 0.000286
C  1.154437 -0.89918 0.000218
C  -0.222895 -1.475024 0.000358
C  0.222929 1.475032 0.000648
C  -2.687089 -1.028526 -0.000009
C  2.687122 1.028534 0.000005
C  -2.269299 1.774932 0.000072
C  2.269332 -1.774924 -0.000014
C  -3.769851 -0.134583 -0.000215
C  3.769884 0.134591 -0.000245
C  -3.581872 1.267242 -0.000184
C  3.581906 -1.267233 -0.000256
H  -2.82779 -2.113372 -0.000058
H  2.827823 2.11338 0.000041
H  -2.083766 2.853299 0.00013
H  2.0838 -2.853291 -0.000033
H  -4.445103 1.938618 -0.00033
H  4.445136 -1.93861 -0.000439
