program: Gaussian 09
title: 000235562
version: EM64L-G09RevD.01
frameworkgroup: C1[X(C14H4Cl2N2O6)]
method: RPBEPBE
basis: SDD
operation: Freq
keyword: #p
keyword: freq=noraman
keyword: PBEPBE/SDD
title: #p freq=noraman PBEPBE/SDD
converged: YES YES NO NO
title: Mulliken charges:
elementType: Cl Cl O O O O O O N N C C C C C C C C C C C C C C H H H H
charge: 0.064262 0.064239 -0.115423 -0.115395 -0.171422 -0.171384 -0.172933 -0.173042 0.022849 0.022965 0.128894 0.128813 0.479725 0.479714 -0.138745 -0.138922 0.287242 0.287161 -0.391911 -0.391870 -0.363193 -0.363298 -0.197930 -0.197870 0.289976 0.290043 0.278728 0.278723
chargesum: 0.00000
title: Mulliken charges with hydrogens summed into heavy atoms:
elementType: Cl Cl O O O O O O N N C C C C C C C C C C C C C C
charge: 0.064262 0.064239 -0.115423 -0.115395 -0.171422 -0.171384 -0.172933 -0.173042 0.022849 0.022965 0.128894 0.128813 0.479725 0.479714 -0.138745 -0.138922 0.287242 0.287161 -0.391911 -0.391870 -0.073217 -0.073254 0.080799 0.080853
polarizability: 2.83525407e+02 -7.94941029e+00 2.82713257e+02 -1.81899747e-02 2.82695274e-03 9.47169784e+01
1716.lowfreq: -0.0016 0.0004 0.0010 2.6667 2.8250 6.0503 24.6513 34.8557 38.3782
frequency: 24.6494 34.8534 38.3776 69.8571 76.9989 77.3092 80.5035 139.3036 165.0051 168.5628 175.4091 181.6866 217.4775 232.5741 256.7956 290.4685 292.4254 302.5953 324.5657 333.7031 366.6675 372.4530 392.9689 426.4280 448.3163 478.4171 485.3573 509.6208 543.9532 567.7768 589.9222 633.0111 652.4087 664.1879 691.2195 695.8318 702.7006 731.9952 752.1181 770.0282 772.5589 816.7951 844.9642 845.0068 853.1155 864.5553 899.5492 971.5893 971.8412 1011.3386 1114.9028 1122.2777 1139.6822 1143.1471 1181.9246 1188.7246 1218.6554 1226.3129 1252.9874 1262.6596 1363.2709 1377.0825 1377.1155 1384.7674 1398.4454 1401.3100 1422.6517 1428.1351 1554.1085 1558.6492 1565.0333 1575.6709 1593.7449 1608.2642 3170.9408 3170.9546 3187.7322 3187.7548
redmass: 16.5705 14.4012 15.6630 15.3630 10.0071 10.3722 9.5950 9.8084 15.7627 18.6141 18.7768 10.8894 8.7981 9.7023 8.9168 16.0563 18.2057 15.2505 7.7192 9.9962 10.8601 8.5743 7.2503 6.0382 6.6751 5.2236 8.4122 9.5521 10.0254 7.1681 6.4485 6.1915 6.9113 9.1545 9.1498 8.6161 7.2496 11.3965 9.2255 7.7559 9.8762 7.8150 1.6775 1.5291 6.5402 7.1965 6.7352 1.3886 1.3818 7.0864 7.6102 3.2653 1.7776 3.2442 1.7548 2.1150 5.4216 9.9783 4.0448 3.0268 8.3178 7.7270 9.4104 9.9935 10.4872 8.7653 2.6544 2.8429 7.0965 8.2447 8.9050 9.2051 10.7951 12.1512 1.0896 1.0896 1.0978 1.0978
irintensity: 0.2349 2.9987 0.4357 1.1962 0.4738 6.0577 1.5515 0.2546 0.1319 0.0079 0.4218 4.0068 1.2972 0.2629 1.6115 0.1791 0.1690 0.1710 2.4635 2.5986 16.6435 4.6556 0.2198 3.3156 1.8483 1.5877 17.8674 0.0044 0.0115 10.4753 8.8930 1.6108 7.4277 22.1869 30.4052 1.5413 17.7192 0.7235 0.2516 3.8829 86.5967 4.4943 14.8269 47.5404 0.1437 5.6992 0.0231 7.6541 0.3278 105.3071 90.3227 1.4046 4.4096 1.5948 1.1361 12.4662 333.9400 11.1780 349.9382 0.2416 10.8212 56.9078 321.1349 1.1322 13.7230 55.7968 27.8951 0.0120 20.3124 10.6933 176.2029 4.4159 45.7917 54.7326 0.0589 1.3593 1.6014 0.0003
temp: 298.150 k
press: 1.00000 atm
elementType: 17 17 8 8 8 8 8 8 7 7 6 6 6 6 6 6 6 6 6 6 6 6 6 6 1 1 1 1
symmnumber: 1
zpe: 412632.2 jmol-1
zpe.correction: 0.157163 hartree
zpe.thermalcorrener: 0.177049 hartree
zpe.thermalcorrenthalpy: 0.177993 hartree
zpe.thermalcorrgfe: 0.106661 hartree
zpe.sumelectzpe: -2015.011821 hartree
zpe.sumelectthermal: -2014.991935 hartree
zpe.sumelectthermalent: -2014.990991 hartree
zpe.sumelectthermalfe: -2015.062323 hartree
dipole: 0.0007 -0.0006 1.4850
dipole: 1.4850
quadrupole: -148.8194 -158.1958 -152.2907
quadrupole: 39.6748 0.0035 -0.0016
quadrupole: 4.2825 -5.0938 0.8112 39.6748 0.0035 -0.0016
hfenergy: -2015.1689842 hartree
pointgroup: C01 [X(C14H4Cl2N2O6)]
dipole: -0.0004407 -0.0004392 -0.5842273 debye
polarizability: 285.1432836|7.6981236|281.0953255|-0.0730875|-0.0751307|94.7170326 unknown
InChI: InChI=1S/C14H4Cl2N2O6/c15-5-1-3-7(17(21)22)11-9(5)13(19)12-8(18(23)24)4-2-6(16)10(12)14(11)20/h1-4H
charge 0 multiplicity 1
28 atoms
Cl -0.413036 4.13995 0.176142
Cl 0.413132 -4.139872 0.179257
O  1.475653 2.060159 1.196815
O  -1.474517 -2.058814 1.200615
O  -3.126931 -1.89544 -1.117115
O  3.125362 1.895979 -1.117406
O  -4.841769 -0.9852 0.091922
O  4.84267 0.983979 0.086833
N  -3.640705 -0.981199 -0.372844
N  3.64047 0.980979 -0.374989
C  -1.43466 0.129955 0.199011
C  1.434769 -0.12987 0.198171
C  -0.660762 1.325134 0.294672
C  0.660924 -1.324951 0.295324
C  0.801182 1.183783 0.595283
C  -0.80075 -1.183293 0.597053
C  -2.813677 0.226973 -0.097421
C  2.813607 -0.22712 -0.098862
C  -1.309074 2.579106 0.121073
C  1.309115 -2.579064 0.122276
C  -3.452873 1.47223 -0.243179
C  3.452697 -1.472475 -0.244244
C  -2.695193 2.652963 -0.132172
C  2.695061 -2.653117 -0.131901
H  -4.525067 1.507588 -0.453924
H  4.524785 -1.508007 -0.455507
H  -3.170655 3.629086 -0.259162
H  3.170442 -3.62934 -0.258421
