program: Gaussian 09
title: 000235554
version: EM64L-G09RevD.01
frameworkgroup: C1[X(C13H10ClNO)]
method: RPBEPBE
basis: SDD
operation: Freq
keyword: #p
keyword: freq=noraman
keyword: PBEPBE/SDD
title: #p freq=noraman PBEPBE/SDD
converged: YES YES NO NO
title: Mulliken charges:
elementType: Cl O N C C C C C C C C C C C C C H H H H H H H H H H
charge: -0.065875 -0.426774 -0.078592 0.503826 0.238831 -0.280191 -0.365385 -0.349921 -0.340161 -0.299659 -0.361079 -0.344278 0.279462 -0.233109 -0.229244 -0.219493 0.283224 0.232535 0.254262 0.241933 0.222879 0.253030 0.257013 0.233927 0.236401 0.356439
chargesum: 0.00000
title: Mulliken charges with hydrogens summed into heavy atoms:
elementType: Cl O N C C C C C C C C C C C C C
charge: -0.065875 -0.070335 -0.078592 0.503826 0.238831 -0.280191 -0.082161 -0.117387 -0.085899 -0.057726 -0.138200 -0.091248 0.279462 0.023904 0.004683 0.016907
polarizability: 3.49130304e+02 -1.07355417e+01 1.66181123e+02 4.78774981e+00 6.61760951e+00 6.60946024e+01
1716.lowfreq: -7.3893 -3.0432 -0.0018 0.0015 0.0019 5.8405 26.6576 45.1206 54.2472
frequency: 26.6312 45.1125 54.2310 108.5135 151.6198 174.1137 189.9515 204.8990 271.9928 336.6818 369.7107 372.3981 375.8933 401.6984 415.3759 453.6408 488.6607 502.5894 515.4397 543.3833 612.3078 634.3095 674.9715 714.6719 732.1913 766.3303 770.6861 804.6841 826.9862 831.6584 862.3576 878.4745 939.8775 952.9358 960.6551 975.4881 994.9397 1002.7648 1012.5828 1035.0309 1099.5489 1113.2664 1142.6619 1160.1287 1168.6503 1186.6589 1231.4501 1252.7677 1274.6400 1305.8188 1343.7167 1379.7579 1390.3047 1425.0837 1431.9534 1457.4241 1497.0803 1556.5280 1577.2905 1577.8072 1604.8021 1627.6565 3008.0833 3119.5894 3137.3214 3137.5847 3152.0803 3164.7930 3165.6300 3171.8444 3176.7679 3581.4871
redmass: 4.2305 7.0312 6.0276 4.9902 4.9337 5.4101 7.0230 6.0965 3.5001 6.0201 1.1742 6.8344 5.3600 5.0212 3.0613 3.2993 5.1595 5.3841 3.6116 2.9035 6.3443 6.9373 6.8924 3.8011 3.6696 1.2515 6.3061 1.2727 2.1000 3.9643 4.0286 1.3544 1.3611 1.3608 1.3801 1.5696 2.6706 1.3673 7.0723 1.9926 1.3958 1.7774 1.3663 1.4103 1.0655 1.7989 1.7773 2.5315 1.8204 1.4301 2.0846 4.3651 3.0869 2.3962 3.7800 2.6032 2.7955 6.3420 5.8274 6.3763 7.2507 6.5321 1.0868 1.0899 1.0889 1.0859 1.0904 1.0957 1.0947 1.0960 1.0995 1.0660
irintensity: 0.7509 1.3732 0.5435 0.3534 0.4439 10.7345 1.0116 5.2393 10.6426 4.5601 142.7739 12.1956 11.7890 12.2158 3.1316 7.0107 14.2738 16.4100 6.6461 21.1978 1.3854 0.7999 23.2050 3.3022 8.7519 68.1132 32.6602 12.1423 61.3455 18.9168 9.0186 0.7576 2.1849 1.5615 0.0619 15.9299 2.4952 3.0693 52.9300 8.5954 84.4343 1.6428 293.1142 1.2394 4.3047 19.4140 4.6272 48.6005 33.7123 1.8429 10.8468 19.1056 11.8112 32.9031 8.2318 8.6645 105.8797 4.1523 26.0221 31.5883 6.7802 105.1539 37.0440 26.1513 4.5956 1.9945 5.1645 11.1384 8.4205 6.7524 21.0035 83.0545
temp: 298.150 k
press: 1.00000 atm
elementType: 17 8 7 6 6 6 6 6 6 6 6 6 6 6 6 6 1 1 1 1 1 1 1 1 1 1
symmnumber: 1
zpe: 506060.0 jmol-1
zpe.correction: 0.192748 hartree
zpe.thermalcorrener: 0.206495 hartree
zpe.thermalcorrenthalpy: 0.207440 hartree
zpe.thermalcorrgfe: 0.150540 hartree
zpe.sumelectzpe: -1090.290890 hartree
zpe.sumelectthermal: -1090.277143 hartree
zpe.sumelectthermalent: -1090.276199 hartree
zpe.sumelectthermalfe: -1090.333098 hartree
dipole: -0.3722 -2.0772 -0.3857
dipole: 2.1452
quadrupole: -74.9208 -94.1450 -104.5418
quadrupole: 4.0811 5.1871 2.7252
quadrupole: 16.2817 -2.9425 -13.3392 4.0811 5.1871 2.7252
hfenergy: -1090.4836383 hartree
pointgroup: C01[X(C13H10Cl1N1O1)]
dipole: 0.0793584 -0.5955253 0.5927778 debye
dipolederiv: -0.1101944 -0.1360884 0.0699623 0.0385459 -0.607845 0.286298 -0.0170516 0.2877542 -0.2263873 -2.0584998 -0.0992865 0.0085432 -0.1974966 -0.3125059 -0.1701689 0.0617547 -0.1643121 -0.1826673 -0.0499454 -0.0006013 -0.0338256 0.2022029 -0.2771377 0.0552914 0.1169704 0.0558844 -0.2643746 0.0256177 -0.0562327 0.0234786 0.0033577 -0.2425265 0.1406107 0.063413 0.1561658 -0.0488688 0.0585284 0.0271978 -0.014944 -0.2292995 -0.0048745 0.0163473 0.0393931 0.040819 -0.0494624 0.1053407 0.2680475 -0.1297732 -0.1623343 0.8346942 -0.4988936 0.083541 -0.4914321 0.1831577 -0.1054334 0.0005594 -0.0011163 0.0012847 -0.022702 -0.0454685 0.0019898 -0.0512292 -0.0921043 0.4337209 -0.0341069 0.0633588 0.3427023 0.2399334 -0.1196332 -0.3100689 -0.1724804 0.0369068 0.245721 -0.0238016 0.084346 -0.1544592 -0.0412057 -0.0958476 -0.0091054 -0.1242133 0.0320466 0.2032149 0.0697411 -0.043891 0.252381 -0.0802365 -0.0824776 0.0012289 -0.0605667 0.0177743 -0.433738 -0.0033555 -0.0009004 -0.3042765 -0.1457822 -0.1024726 0.4568887 -0.0860163 -0.0576233 -0.5901763 -0.0155358 0.0240672 0.242723 -0.0893759 -0.1003959 -0.4001863 -0.1165577 -0.0124954 1.858975 0.109501 0.014964 0.1564279 0.0834877 0.0124259 0.034731 0.0025223 0.0749949 -0.0696409 -0.1552086 0.084941 -0.1803326 -0.2331325 0.0595239 0.0992424 0.0642215 -0.1299729 -0.1197112 0.0897674 -0.0469251 0.149626 0.04574 -0.1060862 -0.0613805 -0.1094155 -0.1001664 -0.0350411 -0.0166285 0.0161378 0.0034975 0.0350913 -0.100153 0.0064454 -0.1019052 -0.0959234 0.1038267 0.0621934 -0.0359982 0.0541411 0.0590163 0.0517501 -0.0464452 0.0554801 0.117184 0.0140643 -0.0429534 0.0181595 -0.147516 -0.0397115 0.0982923 -0.0251208 0.1166045 0.1162128 0.0882964 -0.0562503 0.0582018 -0.0393022 0.0885298 0.0879209 0.0400181 0.0854402 0.0403593 0.0474218 0.0379217 -0.093615 0.0162036 0.1032873 0.0751334 -0.0735284 0.0656896 0.0306864 -0.072932 0.0519513 -0.1004033 0.0596625 0.1147055 0.0883337 -0.0991972 0.091233 0.034153 0.0318739 -0.0406333 0.0472981 -0.0729417 0.1104618 0.0839186 0.0504851 0.0927303 0.0352467 0.0166906 0.0521633 -0.0353891 0.0811013 0.0522333 0.0666446 -0.0509169 0.0658249 0.1285907 0.0474269 -0.0483185 0.0203872 -0.0868109 -0.0387817 0.1052078 0.0427498 0.1079834 0.1048083 -0.1136247 -0.0468624 0.0124418 -0.0483079 0.0875303 0.0383703 0.0057045 0.0390787 0.1415441 0.4782182 0.0068197 -0.0095061 0.01922 0.2811066 0.1555283 -0.0115545 0.1506967 0.1663804 unknown
polarizability: 349.2801498|3.9358787|127.5536766|11.4334527|-48.7146091|104.5722025 unknown
InChI: InChI=1S/C13H10ClNO/c14-13-4-2-1-3-10(13)9-15-11-5-7-12(16)8-6-11/h1-9,16H
charge 0 multiplicity 1
26 atoms
Cl -2.672004 2.454212 -1.460059
O  5.806376 0.307021 -0.054795
N  0.21266 -0.479655 0.302357
C  -2.121715 0.026552 -0.106038
C  1.605514 -0.239184 0.173758
C  -3.128401 0.884497 -0.623261
C  -2.561336 -1.174245 0.528043
C  -0.68426 0.334578 -0.203578
C  2.451007 -0.862318 1.131349
C  2.209625 0.533893 -0.865323
C  3.847143 -0.687958 1.092163
C  3.603245 0.697808 -0.923313
C  4.423255 0.097004 0.062567
C  -4.5009 0.589553 -0.527599
C  -3.926759 -1.489182 0.636246
C  -4.90207 -0.60703 0.107782
H  -1.782154 -1.833385 0.924111
H  -0.424088 1.288758 -0.698425
H  1.983087 -1.474262 1.908517
H  1.589504 0.981655 -1.650075
H  4.482091 -1.166203 1.849042
H  4.077506 1.274222 -1.723026
H  -5.240065 1.281068 -0.941515
H  -4.237243 -2.416631 1.128689
H  -5.968309 -0.844207 0.186293
H  6.297891 -0.156061 0.668292
