program: Gaussian 09
title: 000235551
version: EM64L-G09RevD.01
frameworkgroup: C1[X(C12H11NO4S)]
method: RPBEPBE
basis: SDD
operation: Freq
keyword: #p
keyword: freq=noraman
keyword: PBEPBE/SDD
title: #p freq=noraman PBEPBE/SDD
converged: YES YES NO NO
title: Mulliken charges:
elementType: S O O O O N C C C C C C C C C C C C H H H H H H H H H H H
charge: 0.987665 -0.567481 -0.501134 -0.502581 -0.245435 -0.450296 0.186087 0.444036 0.345269 -0.075334 -0.421049 -0.308612 -0.284439 -0.465481 -0.366750 -0.228257 0.220498 -0.801535 0.291609 0.201924 0.283779 0.252361 0.315472 0.237869 0.314601 0.239708 0.273799 0.240478 0.383228
chargesum: 0.00000
title: Mulliken charges with hydrogens summed into heavy atoms:
elementType: S O O O O N C C C C C C C C C C C C
charge: 0.987665 -0.184252 -0.501134 -0.502581 -0.245435 -0.135695 0.186087 0.444036 0.345269 -0.075334 -0.129440 -0.106688 -0.000660 -0.213119 -0.051278 0.009612 0.220498 -0.047550
polarizability: 2.86032119e+02 9.32273821e+00 1.95522884e+02 9.91332211e-01 9.72381321e-01 9.14948715e+01
1716.lowfreq: -76.2574 -4.3213 -1.6994 -0.0004 0.0020 0.0021 5.5822 25.9716 36.7158
frequency: -76.2526 25.8287 36.7083 47.1602 85.4272 87.5683 138.2850 146.9311 157.4657 174.7155 193.2085 250.8110 269.1404 279.8792 294.3728 320.1396 343.4759 348.2453 418.5929 423.1311 454.8621 495.6949 496.5862 538.1820 545.6883 566.5645 578.9408 590.6457 627.3174 649.5123 658.0074 757.8911 761.3497 798.0649 802.1100 828.9635 833.8419 862.7080 920.6823 920.7722 949.7755 955.2025 968.5576 977.0767 1002.5519 1031.5413 1046.2099 1048.6663 1073.4822 1095.6821 1171.3159 1191.6835 1219.7000 1227.6649 1271.7047 1288.3574 1342.2396 1376.6566 1386.3799 1415.8812 1437.1235 1446.2062 1452.5675 1467.8304 1488.1360 1535.5426 1584.5961 1596.9442 1621.3456 1643.8453 2988.1499 3073.1947 3130.6631 3137.7185 3140.5675 3150.4090 3162.5161 3172.2382 3194.8652 3480.6688 3554.1618
redmass: 1.0649 6.9325 6.7381 4.5461 4.7531 6.4387 3.8006 5.7201 4.3899 1.7505 8.4248 3.5297 4.5708 4.6634 5.7935 4.7381 6.7480 8.0103 8.9309 3.1474 4.7653 3.6864 4.8765 6.4329 5.4673 3.6161 5.1778 2.0171 2.2891 3.5225 5.0763 3.9027 1.8187 6.5127 1.3073 2.7692 9.6827 4.8105 4.9202 1.4930 1.4831 1.4097 13.2791 1.8320 1.3478 1.6652 2.9167 1.2274 2.0727 2.1310 1.3470 1.3020 2.0512 1.8410 1.8038 2.3169 2.2807 1.2315 3.4552 6.1398 2.3937 1.5527 1.7031 1.0467 2.3637 2.8043 6.0898 7.2428 6.9331 4.4002 1.0385 1.0984 1.0877 1.0978 1.0874 1.0927 1.0973 1.0957 1.0948 1.0661 1.0753
irintensity: 0.0039 1.5016 10.5015 1.4246 0.3942 2.5079 2.2442 3.7288 5.4847 47.4737 5.7725 26.8549 5.7387 22.1205 38.0185 6.1953 9.4348 4.8175 81.9651 16.6619 0.1441 12.7815 12.3286 82.5019 12.4246 9.8456 59.4281 72.5438 17.2878 17.8709 14.0385 0.2387 0.4076 10.6325 109.3230 3.3343 67.4606 7.5295 5.6479 29.9450 2.7574 2.8662 75.6726 35.3216 7.0692 8.0237 12.5010 76.0425 41.3595 9.1076 8.3696 18.3126 56.6260 5.6146 12.9771 96.1281 42.7653 50.0902 206.1436 24.3946 1.3993 51.5476 51.6872 21.2787 237.2196 263.3850 44.2066 11.6547 18.6674 122.8798 5.8837 13.1721 19.1549 6.4059 2.1410 3.9339 17.9016 8.7654 9.3295 45.7463 16.2516
temp: 298.150 k
press: 1.00000 atm
elementType: 16 8 8 8 8 7 6 6 6 6 6 6 6 6 6 6 6 6 1 1 1 1 1 1 1 1 1 1 1
symmnumber: 1
zpe: 545671.1 jmol-1
zpe.correction: 0.207835 hartree
zpe.thermalcorrener: 0.224615 hartree
zpe.thermalcorrenthalpy: 0.225559 hartree
zpe.thermalcorrgfe: 0.161968 hartree
zpe.sumelectzpe: -1216.142184 hartree
zpe.sumelectthermal: -1216.125404 hartree
zpe.sumelectthermalent: -1216.124460 hartree
zpe.sumelectthermalfe: -1216.188052 hartree
dipole: 2.8619 -2.1913 1.4147
dipole: 3.8722
quadrupole: -134.8047 -98.4115 -118.0972
quadrupole: -12.3454 -10.6762 -1.5838
quadrupole: -17.7002 18.6930 -0.9928 -12.3454 -10.6762 -1.5838
hfenergy: -1216.3500192 hartree
pointgroup: C01 [X(C12H11N1O4S1)]
dipole: 1.120073 0.8616238 -0.5691023 debye
polarizability: 286.2960216|-7.8050677|195.1862905|2.1496857|-2.623668|91.5675625 unknown
InChI: InChI=1S/C12H11NO4S/c1-8(14)13-12-4-2-3-9-7-10(18(15,16)17)5-6-11(9)12/h2-7,13,15H,1H3
charge 0 multiplicity 1
29 atoms
S  -4.089468 0.338319 0.049305
O  -4.2857 0.472635 -1.794894
O  -4.773876 -1.039826 0.547719
O  -4.516348 1.755397 0.704914
O  5.003904 -0.007376 0.037485
N  2.834967 0.907583 -0.009976
C  0.572778 -0.070921 0.02687
C  -0.266082 -1.256776 0.050855
C  2.013553 -0.250383 0.024187
C  -2.229229 0.166584 0.027648
C  -1.691247 -1.109371 0.045026
C  -0.065088 1.216842 0.016034
C  -1.453808 1.353511 0.013647
C  0.323661 -2.56077 0.077146
C  2.560603 -1.546443 0.052838
C  1.71197 -2.689845 0.079892
C  4.236739 0.995201 -0.004103
C  4.753981 2.432466 -0.05315
H  -2.338366 -1.9929 0.068857
H  0.520159 2.143272 0.012942
H  -1.938341 2.333773 0.019653
H  -0.326499 -3.441636 0.095719
H  3.64562 -1.66011 0.053795
H  2.172056 -3.683058 0.101507
H  2.35035 1.80472 -0.049892
H  4.412876 2.952956 -0.967349
H  5.852815 2.40851 -0.051404
H  4.411654 3.014141 0.822917
H  -5.256134 0.634103 -1.983187
