program: Gaussian 09
title: 000235550
version: EM64L-G09RevD.01
frameworkgroup: C1[X(C12H11NO3)]
method: RPBEPBE
basis: SDD
operation: Freq
keyword: #p
keyword: freq=noraman
keyword: PBEPBE/SDD
title: #p freq=noraman PBEPBE/SDD
converged: YES YES NO NO
title: Mulliken charges:
elementType: O O O N C C C C C C C C C C C C H H H H H H H H H H H
charge: -0.249047 -0.377611 -0.244537 -0.704285 0.219048 0.442290 0.318940 -0.498843 0.339315 -0.419855 -0.492212 -0.405506 -0.448846 -0.217117 -0.380837 0.212615 0.235458 0.239116 0.237532 0.252266 0.212299 0.219158 0.328688 0.305971 0.259540 0.230319 0.386139
chargesum: 0.00000
title: Mulliken charges with hydrogens summed into heavy atoms:
elementType: O O O N C C C C C C C C C C C C
charge: -0.249047 0.008528 -0.244537 -0.069626 0.219048 0.442290 0.318940 -0.263384 0.339315 -0.180738 -0.254680 -0.153240 -0.236547 0.002041 0.109022 0.212615
polarizability: 2.07509816e+02 -1.32176760e+01 1.69378599e+02 -1.10453455e+01 -7.23656510e+00 7.65213595e+01
1716.lowfreq: 0.0002 0.0005 0.0005 3.5021 8.8818 10.5980 19.7686 49.9633 60.5706
frequency: 19.7360 49.9630 60.5679 92.3672 152.9427 173.7471 193.5548 239.7320 298.6665 323.6986 352.1026 383.2625 407.5400 410.5717 432.2831 452.9563 483.8105 505.7865 525.3587 526.6631 549.1396 569.5784 616.0449 669.4412 672.2561 706.6093 717.8010 741.3592 785.8393 829.7374 838.8167 851.5747 861.8153 871.1499 891.4519 956.3146 973.1962 981.8362 992.7998 1002.4443 1082.7994 1105.6746 1108.4528 1150.3986 1171.3258 1200.9296 1235.2808 1240.0876 1285.6793 1317.4030 1323.8664 1352.3323 1363.1886 1413.8937 1427.6611 1447.8420 1455.5076 1476.4397 1529.9684 1594.8650 1599.0233 1632.8596 1644.7059 1653.8586 3019.1355 3103.5723 3116.2450 3131.1271 3132.9101 3155.3079 3168.6047 3170.4293 3508.9080 3562.5131 3697.1255
redmass: 7.5335 6.7663 8.1268 4.6970 4.0884 4.3942 4.5876 5.2292 3.2829 2.7624 1.7151 3.5553 1.2518 2.5204 2.5138 4.6744 3.4559 5.2470 3.7304 4.5509 5.3581 3.1115 1.4183 3.7207 4.2899 4.5109 5.9188 1.4259 1.6413 4.3752 1.8017 2.1737 4.4391 1.5180 5.0589 1.3200 1.3827 2.1012 2.8540 3.0670 2.2053 1.6333 1.7812 1.2501 1.4021 2.3879 1.7466 1.2595 1.7012 1.8899 2.2012 1.4012 2.6143 2.9850 7.2056 1.6700 1.4344 3.0849 4.8787 5.1005 6.4275 6.2837 8.5735 1.2189 1.0605 1.1035 1.0867 1.0897 1.0891 1.0995 1.0923 1.0933 1.0641 1.0453 1.1033
irintensity: 1.7744 0.0786 2.6758 0.5629 3.9397 5.3783 0.6266 0.4492 3.9233 3.9256 29.3434 4.7727 232.3350 12.4563 4.1564 1.5001 10.9597 6.4656 14.6907 30.6362 8.2252 15.8741 127.4709 4.6764 17.2457 60.8472 5.6313 26.1235 11.5861 69.4375 74.9688 8.4204 5.1851 7.2342 10.2079 1.4870 2.4191 82.4243 15.6711 82.9833 5.7171 30.1903 135.6425 2.3255 72.7111 96.1333 3.5299 28.7901 3.6921 25.9596 48.0942 5.9736 23.6831 6.1404 18.7371 44.5597 5.3894 81.7504 46.7156 92.0727 17.5585 13.4747 194.0981 225.2342 33.5606 7.3647 14.2700 4.5668 22.0658 37.8578 6.7434 4.6537 33.9579 51.7008 27.0731
temp: 298.150 k
press: 1.00000 atm
elementType: 8 8 8 7 6 6 6 6 6 6 6 6 6 6 6 6 1 1 1 1 1 1 1 1 1 1 1
symmnumber: 1
zpe: 542772.3 jmol-1
zpe.correction: 0.206731 hartree
zpe.thermalcorrener: 0.220685 hartree
zpe.thermalcorrenthalpy: 0.221630 hartree
zpe.thermalcorrgfe: 0.164867 hartree
zpe.sumelectzpe: -743.165446 hartree
zpe.sumelectthermal: -743.151491 hartree
zpe.sumelectthermalent: -743.150547 hartree
zpe.sumelectthermalfe: -743.207310 hartree
dipole: 1.4772 1.8381 0.2750
dipole: 2.3741
quadrupole: -81.4513 -84.9136 -92.7486
quadrupole: 0.7744 -0.3020 0.4233
quadrupole: 4.9198 1.4576 -6.3774 0.7744 -0.3020 0.4233
hfenergy: -743.3721766 hartree
pointgroup: C01 [X(C12H11N1O3)]
dipole: -0.5119839 -0.7790844 -0.0578861 debye
polarizability: 210.1987802|-9.4904413|157.2474753|-0.8113116|30.1796734|85.9635194 unknown
InChI: InChI=1S/C12H11NO3/c13-11-3-1-2-8-4-5-9(6-10(8)11)16-7-12(14)15/h1-6,14H,7,13H2
charge 0 multiplicity 1
27 atoms
O  -2.397347 1.349209 -0.025542
O  -3.887907 -0.827585 1.335301
O  -2.732365 -2.132521 -0.198891
N  1.317503 -2.251882 -1.048994
C  1.165335 0.066145 -0.198364
C  1.847589 1.223022 0.33976
C  1.945775 -1.098655 -0.572813
C  -0.26146 0.096371 -0.342915
C  -0.987306 1.21706 0.069484
C  1.05608 2.351197 0.747504
C  3.274999 1.230137 0.454921
C  -0.330478 2.356198 0.628656
C  3.350921 -1.049301 -0.452673
C  4.006056 0.109565 0.049643
C  -3.131333 0.269911 -0.681589
C  -3.201129 -1.022578 0.143685
H  -0.776981 -0.757166 -0.789114
H  1.568839 3.226803 1.162319
H  3.777609 2.115378 0.859347
H  -0.936888 3.211467 0.940877
H  3.94613 -1.925154 -0.739407
H  5.09902 0.107238 0.128725
H  0.31243 -2.384992 -0.984761
H  1.880068 -3.057042 -1.3088
H  -4.150606 0.667671 -0.81102
H  -2.692623 0.021966 -1.665497
H  -3.890428 -1.66946 1.86806
