program: Gaussian 09
title: 000235547
version: EM64L-G09RevD.01
frameworkgroup: C1[X(C10H14N2O2)]
method: RPBEPBE
basis: SDD
operation: Freq
keyword: #p
keyword: freq=noraman
keyword: PBEPBE/SDD
title: #p freq=noraman PBEPBE/SDD
converged: YES YES NO NO
title: Mulliken charges:
elementType: O O N N C C C C C C C C C C H H H H H H H H H H H H H H
charge: -0.292687 -0.299128 -0.101882 -0.703741 -0.463884 0.232155 0.365775 -0.321217 -0.376297 -0.611442 -0.633201 0.497815 -0.432091 -0.393502 0.253750 0.239635 0.283279 0.241259 0.281136 0.222467 0.227823 0.223405 0.297031 0.229139 0.216770 0.215632 0.299885 0.302114
chargesum: 0.00000
title: Mulliken charges with hydrogens summed into heavy atoms:
elementType: O O N N C C C C C C C C C C
charge: -0.292687 -0.299128 -0.101882 -0.101743 0.029501 0.232155 0.365775 -0.037939 -0.135038 0.119984 0.116375 0.497815 -0.215320 -0.177869
polarizability: 1.69063348e+02 -1.02992870e+01 1.26897284e+02 1.16224909e+01 7.72271695e+00 9.21470874e+01
1716.lowfreq: -7.0387 -4.0601 -0.0003 0.0001 0.0002 8.9655 25.0551 50.5373 71.8714
frequency: 25.0512 50.5365 71.8633 99.8631 123.9916 134.4272 148.6998 199.8670 221.5912 263.6805 291.6089 311.3321 333.9582 357.2218 363.5216 384.7491 410.2401 416.6167 460.7889 511.8542 520.5991 545.8096 633.5161 673.9396 709.5916 711.0518 731.4368 803.8981 820.0458 823.9879 927.4743 942.0161 951.3498 987.7363 997.2191 1000.8398 1019.0683 1057.8213 1093.4790 1127.3578 1145.1437 1163.8313 1183.7519 1199.6247 1238.1958 1247.1123 1305.0987 1320.4732 1340.3836 1384.5733 1395.4060 1411.1057 1437.3931 1441.1218 1459.7438 1468.1193 1484.3209 1492.2298 1504.1153 1509.6994 1587.9929 1591.2432 1632.5923 1646.2499 2962.1483 2971.5388 3014.3252 3037.8139 3047.1385 3083.8642 3119.3084 3121.5755 3124.1651 3127.2764 3152.8239 3159.9937 3573.3858 3713.8340
redmass: 4.3694 3.9002 4.0941 3.7426 1.3198 2.8795 1.1291 4.0685 4.9191 2.8678 1.2020 2.8615 1.0534 6.9915 3.0481 2.6588 3.9998 2.8917 3.2815 2.7277 4.3320 4.5287 6.7710 6.2426 3.3909 4.3106 5.0427 1.2787 1.7997 4.9029 1.3595 1.3303 3.6065 4.4079 2.5814 2.1194 1.4546 1.4083 1.2231 1.2343 1.3875 2.0407 1.5690 1.7416 3.9181 1.3400 2.1503 1.6373 1.2589 6.0764 2.8244 1.1914 3.0053 1.1998 1.0818 1.0549 1.0776 1.1219 1.1786 2.7862 6.5214 5.9404 1.6602 2.3778 1.0390 1.0360 1.0572 1.0988 1.1017 1.1072 1.0977 1.0891 1.0885 1.0968 1.0956 1.0955 1.0447 1.1041
irintensity: 2.9134 1.9028 5.3197 3.5641 0.6795 1.9324 0.1716 2.2601 1.8530 8.1734 308.1190 20.4166 9.5968 1.3163 6.2001 4.9981 2.2032 0.1960 3.5393 19.0679 11.8188 15.1208 3.1297 1.1915 0.5977 24.3617 37.5143 2.7940 95.5134 4.9639 1.3428 1.4581 13.3038 40.4608 28.1372 49.6065 4.0516 10.8566 1.5822 31.7668 0.7298 104.4921 54.2938 104.2018 23.1915 44.9226 11.1452 13.3586 2.3483 19.6869 39.2624 36.0714 1.9729 10.9318 29.5564 13.2054 10.8334 22.5079 10.2715 338.2844 94.5504 172.1699 35.6719 139.0222 54.9568 94.1512 40.3243 37.1328 32.0007 12.4657 1.6777 17.9931 25.9094 1.2305 5.8349 7.9243 63.3765 18.9407
temp: 298.150 k
press: 1.00000 atm
elementType: 8 8 7 7 6 6 6 6 6 6 6 6 6 6 1 1 1 1 1 1 1 1 1 1 1 1 1 1
symmnumber: 1
zpe: 598482.2 jmol-1
zpe.correction: 0.227950 hartree
zpe.thermalcorrener: 0.242679 hartree
zpe.thermalcorrenthalpy: 0.243623 hartree
zpe.thermalcorrgfe: 0.185684 hartree
zpe.sumelectzpe: -648.347517 hartree
zpe.sumelectthermal: -648.332788 hartree
zpe.sumelectthermalent: -648.331844 hartree
zpe.sumelectthermalfe: -648.389782 hartree
dipole: 0.7625 1.6011 2.3245
dipole: 2.9237
quadrupole: -58.6600 -83.4595 -83.1987
quadrupole: -10.7379 0.0579 -1.6717
quadrupole: 16.4461 -8.3534 -8.0926 -10.7379 0.0579 -1.6717
hfenergy: -648.5754667 hartree
pointgroup: C01 [X(C10H14N2O2)]
dipole: -0.0721683 -1.0613286 -0.4375972 debye
polarizability: 163.9608639|22.0473888|102.9948941|-12.9686703|12.258865|121.1519606 unknown
InChI: InChI=1S/C10H14N2O2/c1-12(2)10(13)7-14-9-5-3-8(11)4-6-9/h3-6H,7,11H2,1-2H3
charge 0 multiplicity 1
28 atoms
O  0.534916 1.100537 -1.342307
O  2.003455 2.082893 1.732204
N  3.04033 0.500694 0.364581
N  -4.268863 -0.955439 0.853607
C  1.343858 2.084326 -0.613885
C  2.151514 1.538224 0.587943
C  -0.647008 0.623051 -0.70883
C  -1.037439 0.936873 0.613659
C  -1.459026 -0.21602 -1.505459
C  3.837819 -0.010754 1.493141
C  3.298664 -0.122904 -0.944905
C  -3.074463 -0.433976 0.339349
C  -2.244006 0.410837 1.125875
C  -2.657478 -0.741298 -0.989326
H  0.713029 2.90039 -0.218155
H  2.02654 2.49279 -1.379507
H  -0.416633 1.566507 1.259132
H  -1.142585 -0.442895 -2.528715
H  3.572274 0.563102 2.393732
H  4.919159 0.107234 1.287474
H  3.62459 -1.083521 1.661067
H  4.302624 0.157586 -1.322115
H  2.529333 0.1644 -1.674615
H  3.2654 -1.224056 -0.842427
H  -2.537845 0.657837 2.153414
H  -3.278605 -1.389997 -1.619203
H  -4.862374 -1.553041 0.287288
H  -4.570581 -0.731079 1.796383
