program: Gaussian 09
title: 000020620
version: EM64L-G09RevD.01
frameworkgroup: C1[X(C8H7ClO2)]
method: RPBEPBE
basis: SDD
operation: Freq
keyword: #p
keyword: freq=noraman
keyword: PBEPBE/SDD
title: #p freq=noraman PBEPBE/SDD
converged: YES YES NO NO
title: Mulliken charges:
elementType: Cl O O C C C C C C C C H H H H H H H
charge: -0.030551 -0.298345 -0.193757 0.511635 -0.262204 -0.329128 -0.221631 -0.204881 -0.225015 0.250024 -0.739061 0.252992 0.257169 0.236145 0.236887 0.259256 0.248235 0.252231
chargesum: 0.00000
title: Mulliken charges with hydrogens summed into heavy atoms:
elementType: Cl O O C C C C C C C C
charge: -0.030551 -0.298345 -0.193757 0.511635 -0.262204 -0.076136 0.035538 0.031264 0.011872 0.250024 0.020661
polarizability: 1.29603740e+02 -9.42986166e+00 1.03733351e+02 7.12457171e+00 3.79145593e+00 5.81965002e+01
1716.lowfreq: -11.1175 -5.7104 -0.0011 0.0020 0.0025 9.5997 40.4084 61.5240 80.3824
frequency: 40.3950 61.5139 80.3789 88.7107 152.9275 228.0712 273.0566 298.0760 381.5393 442.7606 463.4985 512.2332 524.5393 554.2794 635.2142 662.1293 708.6540 743.1776 777.0757 855.5957 867.6598 943.9525 981.8537 986.6162 1017.7248 1032.3681 1039.8284 1120.6577 1158.1282 1169.0114 1200.9903 1254.6575 1375.2415 1383.0605 1427.3943 1451.9372 1452.6955 1457.0277 1586.9772 1594.4927 1694.1287 3009.7780 3100.5561 3143.3433 3146.0497 3157.0988 3169.9061 3180.1684
redmass: 5.5217 1.9892 1.5618 5.2284 6.1134 9.8614 5.6358 4.3512 5.7015 3.3234 6.0753 4.5074 5.0467 3.4615 5.4181 6.1336 4.5326 1.9232 2.0493 2.2429 2.5426 1.3837 1.3277 2.1372 6.2231 2.1015 1.6867 1.5595 3.1654 1.0812 2.8448 1.4543 11.0384 1.2365 2.2005 1.0542 1.0684 2.4968 6.9488 7.1847 10.5727 1.0374 1.0959 1.0859 1.1018 1.0906 1.0952 1.1007
irintensity: 0.9632 3.2041 1.3460 3.4384 1.2990 1.5397 1.0614 1.7993 1.5920 9.9171 5.1730 2.0641 10.2657 5.5677 4.1578 14.7511 18.3971 25.3524 80.8011 32.2908 48.9228 4.6869 0.2311 86.4271 35.5095 22.4520 14.3167 3.4315 449.9211 4.9382 10.1271 0.8957 0.1791 63.2294 14.8989 18.9058 27.5586 74.7416 4.0823 6.6485 177.2677 0.9221 5.7279 1.4234 8.9302 9.7305 7.6499 10.1508
temp: 298.150 k
press: 1.00000 atm
elementType: 17 8 8 6 6 6 6 6 6 6 6 1 1 1 1 1 1 1
symmnumber: 1
zpe: 338466.2 jmol-1
zpe.correction: 0.128915 hartree
zpe.thermalcorrener: 0.139486 hartree
zpe.thermalcorrenthalpy: 0.140430 hartree
zpe.thermalcorrgfe: 0.091101 hartree
zpe.sumelectzpe: -918.761069 hartree
zpe.sumelectthermal: -918.750498 hartree
zpe.sumelectthermalent: -918.749554 hartree
zpe.sumelectthermalfe: -918.798883 hartree
dipole: 0.8221 -1.3907 -1.4734
dipole: 2.1865
quadrupole: -53.7650 -65.4884 -78.4053
quadrupole: 0.3027 5.4071 1.6536
quadrupole: 12.1213 0.3979 -12.5191 0.3027 5.4071 1.6536
hfenergy: -918.8899841 hartree
pointgroup: C01 [X(C8H7Cl1O2)]
dipole: -0.2882671 -0.5320038 0.6114404 debye
dipolederiv: -0.2692283 -0.2746629 -0.0199129 -0.2611922 -0.5624251 0.0027602 -0.0040973 0.0035374 -0.0465048 -1.8576342 0.0157213 0.3135519 -0.1114685 -0.252338 0.0521135 0.3532877 0.0141616 -0.6100074 -0.6012871 -0.0048654 -0.1483902 -0.0371532 -0.25844 -0.0110152 0.3777129 -0.0355848 -0.9352944 1.0482555 -0.1614167 -0.0277449 -0.0814457 0.0001065 0.0034578 0.2699021 -0.0086552 0.0388794 0.1794411 0.4621305 0.0474127 0.4351006 0.7710062 0.0055793 -0.0389395 -0.0259034 -0.0465677 -0.167509 0.0337334 0.0551074 -0.0955674 0.008638 -0.0411787 0.0187418 -0.0089484 -0.1100823 -0.1160744 -0.1345437 0.0164433 -0.1062847 -0.1191994 -0.0362516 0.0141977 -0.0307725 -0.0796877 -0.0165235 0.0553104 0.0238529 0.0662674 0.0616408 -0.0149756 0.0229059 -0.020552 -0.1418502 0.0683567 -0.0157035 0.0590917 0.0184296 -0.0114059 -0.018372 0.0516603 -0.0263428 -0.1438941 1.8618311 0.0250887 -0.1132016 0.2127673 0.2041822 -0.0278812 -0.8472191 0.0504007 1.413657 -0.3642588 -0.0307442 -0.136893 -0.1097654 0.0096908 -0.0457076 -0.1890633 -0.0312165 -0.10878 0.0637052 0.0593545 -0.0398033 0.0608309 -0.0108182 0.0340764 -0.0316086 0.0353908 0.149702 0.0674441 0.0405161 -0.0191606 0.0564261 -0.0082932 0.0368743 -0.0293559 0.0362828 0.1553617 0.0251975 -0.0850208 -0.0078435 -0.095628 -0.0485655 0.0175432 -0.0133884 0.0179342 0.1596392 -0.096974 -0.0077493 -0.0509325 -0.0039722 0.0793151 0.0117709 -0.0549272 0.0123407 0.152403 0.0990722 0.0283727 -0.0089064 -0.0092694 -0.0250528 -0.069717 0.0035701 -0.0592442 0.1076347 -0.0262202 0.0172902 0.0562116 0.0282453 0.1261773 -0.0103708 0.101509 -0.0200691 0.0082571 0.1024061 -0.0228112 0.0011174 0.0336796 0.035781 0.111294 -0.0048883 0.0972407 0.0371346 unknown
polarizability: 128.270203|11.4300755|104.5040921|6.7795309|-6.0192024|58.7592961 unknown
InChI: InChI=1S/C8H7ClO2/c1-6(10)11-8-5-3-2-4-7(8)9/h2-5H,1H3
charge 0 multiplicity 1
18 atoms
Cl 0.178283 2.435785 -0.003744
O  1.247709 -0.357363 0.713177
O  1.972332 -0.216494 -1.519067
C  -0.123532 -0.328462 0.335892
C  -0.768868 0.885926 0.013301
C  -0.864545 -1.52691 0.370923
C  -2.144831 0.913391 -0.282995
C  -2.245933 -1.509029 0.079894
C  -2.884294 -0.291135 -0.249376
C  2.245179 -0.233234 -0.309236
C  3.601871 -0.128188 0.341949
H  -0.345481 -2.455565 0.627178
H  -2.627358 1.86285 -0.53259
H  -2.818277 -2.441662 0.108039
H  -3.954427 -0.27143 -0.479082
H  3.7041 0.86945 0.805638
H  4.389635 -0.259283 -0.413588
H  3.707338 -0.877048 1.143688
