program: Gaussian 09
title: 000235537
version: EM64L-G09RevD.01
frameworkgroup: C1[X(C11H22N2O3)]
method: RPBEPBE
basis: SDD
operation: Freq
keyword: #p
keyword: freq=noraman
keyword: PBEPBE/SDD
title: #p freq=noraman PBEPBE/SDD
converged: YES YES NO NO
title: Mulliken charges:
elementType: O O O N N C C C C C C C C C C C H H H H H H H H H H H H H H H H H H H H H H
charge: -0.456578 -0.218579 -0.316473 -0.468838 -0.660630 0.265441 -0.436415 -0.374185 -0.379991 -0.376530 -0.354429 -0.718016 0.118867 -0.356795 0.269575 -0.696619 0.221884 0.266694 0.208362 0.196277 0.201706 0.192550 0.188411 0.190153 0.188758 0.190252 0.215423 0.274721 0.233441 0.336719 0.194341 0.194182 0.210436 0.214250 0.210111 0.390446 0.301842 0.339237
chargesum: 0.00000
title: Mulliken charges with hydrogens summed into heavy atoms:
elementType: O O O N N C C C C C C C C C C C
charge: -0.066131 -0.218579 -0.316473 -0.132119 -0.019552 0.265441 0.052163 0.030454 0.014265 0.002033 0.024581 0.005568 0.118867 0.031728 0.269575 -0.061821
polarizability: 1.50280162e+02 -3.89234919e-01 1.42494310e+02 -3.29666521e+00 2.30223161e+00 1.34170079e+02
1716.lowfreq: -4.1422 -2.5268 -0.0010 0.0001 0.0005 7.2331 21.7916 36.7657 43.3662
frequency: 21.6725 36.7006 43.2998 54.0367 60.1145 77.0426 91.1623 100.5274 125.1460 137.4658 145.3929 163.8929 204.0514 232.6649 238.7119 242.3759 256.6104 272.5613 281.9426 329.5276 350.9196 382.0339 396.7774 450.1625 469.0383 495.1151 525.3784 543.3933 561.6913 610.4575 633.9474 715.2903 720.7906 727.3378 732.0639 750.0568 774.2408 822.1345 861.3784 888.9049 915.5695 931.9019 988.4931 994.5320 1004.4617 1024.8585 1030.5215 1041.0354 1056.6194 1079.1856 1079.5509 1082.6843 1106.4525 1124.4212 1162.3251 1187.7938 1200.7894 1226.9092 1235.6784 1265.5796 1272.0214 1280.3996 1287.4809 1293.0562 1310.8188 1314.2542 1337.9203 1343.1719 1353.5800 1354.2107 1373.9586 1389.0691 1451.0710 1460.6061 1461.3038 1462.2632 1467.3537 1474.7816 1476.8353 1482.3500 1484.6680 1488.2743 1499.8235 1597.9592 1642.6803 1671.4234 2949.4264 2952.8862 2955.2103 2962.0997 2967.5600 2971.3276 2984.9701 2995.8310 2996.8368 3002.2678 3008.7073 3025.1635 3039.2377 3068.1849 3069.6745 3073.6192 3099.8085 3120.0551 3524.5140 3536.6029 3546.8361 3701.1661
redmass: 5.0154 4.1687 1.8837 3.9326 3.7519 4.5293 2.7021 2.4651 2.5339 2.3020 3.5509 3.1425 3.1924 1.1178 1.0964 3.0212 3.6401 3.2532 1.1720 4.0775 3.1704 4.6698 3.6049 3.2802 1.1408 2.7177 3.5158 3.6187 1.2183 1.2777 3.9424 3.2199 1.0936 3.4298 1.4191 1.8456 1.6790 1.5100 2.1564 1.8768 1.3018 2.2347 2.4224 1.4609 3.3417 2.5571 2.7246 2.0986 2.6687 2.0150 1.8908 1.7854 2.5831 3.1412 2.0026 2.0135 1.9266 1.4393 1.4148 1.3679 1.3236 1.0410 1.2593 1.1020 1.3800 1.6466 1.7503 1.5898 1.6383 1.5822 1.2646 1.2172 1.0785 1.1138 1.0756 1.0846 1.0795 1.0792 1.0424 1.0827 1.0559 1.0883 2.0511 1.3745 3.1698 8.8320 1.0590 1.0589 1.0602 1.0601 1.0590 1.0365 1.0967 1.0938 1.0384 1.0644 1.0965 1.1032 1.1043 1.1006 1.0994 1.1036 1.1001 1.1017 1.0643 1.0620 1.0605 1.1041
irintensity: 0.0254 4.7461 1.2686 0.2833 0.1844 17.1990 0.3563 1.1323 0.1976 1.1976 5.3004 2.3438 0.0689 0.0073 0.0707 1.9186 5.2579 1.8812 23.8115 1.4244 2.8112 0.2861 0.2976 12.9311 319.4991 2.2851 22.1635 19.6525 95.3278 118.1259 10.4023 73.1601 14.4366 2.0637 7.8929 14.2423 1.1829 1.9531 4.7384 4.6191 1.7566 4.7617 58.9564 17.2125 6.8999 52.2894 111.4708 15.7206 6.0818 2.3920 11.8362 10.4460 10.7387 15.7085 12.0397 12.0287 32.3161 8.3993 5.7701 1.2394 2.2902 0.0522 2.3026 0.7208 17.6954 79.0432 31.8065 26.5897 1.2887 1.6303 26.3484 11.3080 6.8912 48.7150 7.3701 13.8477 3.0816 2.6865 12.0579 3.6711 16.9051 25.5878 471.9581 77.4124 222.7256 160.3315 0.5069 3.6484 1.6494 16.4119 152.0376 37.6761 0.6799 1.2967 17.4337 18.2318 5.5863 0.5321 125.6981 87.5214 56.6694 22.1375 24.7196 3.7934 27.0276 63.1104 36.7123 36.1753
temp: 298.150 k
press: 1.00000 atm
elementType: 8 8 8 7 7 6 6 6 6 6 6 6 6 6 6 6 1 1 1 1 1 1 1 1 1 1 1 1 1 1 1 1 1 1 1 1 1 1
symmnumber: 1
zpe: 854424.9 jmol-1
zpe.correction: 0.325433 hartree
zpe.thermalcorrener: 0.345385 hartree
zpe.thermalcorrenthalpy: 0.346329 hartree
zpe.thermalcorrgfe: 0.275149 hartree
zpe.sumelectzpe: -766.284527 hartree
zpe.sumelectthermal: -766.264575 hartree
zpe.sumelectthermalent: -766.263631 hartree
zpe.sumelectthermalfe: -766.334811 hartree
dipole: -0.8145 0.0137 4.5609
dipole: 4.6331
quadrupole: -95.4357 -101.3246 -92.7743
quadrupole: -1.0924 -12.7710 4.2899
quadrupole: 1.0758 -4.8130 3.7372 -1.0924 -12.7710 4.2899
hfenergy: -766.60996 hartree
pointgroup: C01 [X(C11H22N2O3)]
dipole: -0.2959876 -0.0428318 1.7980934 debye
polarizability: 150.1862341|-0.275957|142.3642226|-3.5193432|2.5329716|134.3940947 unknown
InChI: InChI=1S/C11H22N2O3/c1-3-4-5-6-7-8-11(2,9(14)15)13-10(12)16/h13-14H,3-8,12H2,1-2H3
charge 0 multiplicity 1
38 atoms
O  -2.463491 -1.669519 1.769887
O  -2.046425 -2.920467 -0.135998
O  -2.173951 2.405762 -0.929436
N  -2.383635 0.638536 0.611785
N  -2.652142 2.864894 1.302627
C  -2.124554 -0.456575 -0.349177
C  -0.698666 -0.349711 -0.994099
C  0.468656 -0.357102 0.01394
C  1.833292 -0.13477 -0.676553
C  3.023627 -0.147085 0.30872
C  4.3879 0.086012 -0.378694
C  -3.206155 -0.48886 -1.471042
C  -2.198521 -1.800663 0.390413
C  5.580267 0.069535 0.605029
C  -2.389075 1.981148 0.250635
C  6.939425 0.302647 -0.089747
H  -0.591873 -1.193007 -1.702312
H  -0.690892 0.590318 -1.574412
H  0.308783 0.436225 0.771153
H  0.495894 -1.322558 0.562052
H  1.812792 0.83424 -1.216823
H  1.98787 -0.91839 -1.447463
H  3.045992 -1.118867 0.84562
H  2.866034 0.632597 1.083436
H  4.545138 -0.690946 -1.156073
H  4.368171 1.059026 -0.912883
H  -4.21703 -0.58452 -1.036727
H  -3.149816 0.45575 -2.034944
H  -3.023916 -1.340746 -2.146939
H  -2.544078 0.359146 1.581033
H  5.422234 0.846035 1.38149
H  5.598442 -0.903098 1.138389
H  6.95801 1.2815 -0.605285
H  7.774415 0.286542 0.634938
H  7.135055 -0.478484 -0.84858
H  -2.496979 -2.572876 2.184892
H  -2.85635 2.573307 2.255887
H  -2.668448 3.854221 1.069862
