program: Gaussian 09
title: 000235535
version: EM64L-G09RevD.01
frameworkgroup: C1[X(C10H12FNO2)]
method: RPBEPBE
basis: SDD
operation: Freq
keyword: #p
keyword: freq=noraman
keyword: PBEPBE/SDD
title: #p freq=noraman PBEPBE/SDD
converged: NO YES NO NO
title: Mulliken charges:
elementType: F O O N C C C C C C C C C C H H H H H H H H H H H H
charge: -0.208549 -0.429305 -0.218826 -0.647280 0.112362 -0.411000 0.384545 0.102942 -0.711551 -0.368922 -0.347900 -0.368155 -0.382035 0.318383 0.237736 0.235037 0.230481 0.205360 0.233400 0.294134 0.280781 0.299275 0.272949 0.253604 0.252312 0.380222
chargesum: 0.00000
title: Mulliken charges with hydrogens summed into heavy atoms:
elementType: F O O N C C C C C C C C C C
charge: -0.208549 -0.049083 -0.218826 -0.072365 0.112362 0.061773 0.384545 0.102942 -0.042309 -0.069647 -0.074952 -0.114551 -0.129723 0.318383
polarizability: 1.51060518e+02 8.48988566e-01 1.12760124e+02 4.07370454e-01 -1.34128291e+01 9.00003075e+01
1716.lowfreq: -9.9816 -5.9435 -0.0003 0.0001 0.0005 7.8977 39.2668 58.2852 80.2284
frequency: 38.9412 58.2536 80.2196 103.1147 146.1735 172.2632 191.1432 223.9129 262.8427 274.3448 299.2250 336.2003 361.7291 379.2785 399.9894 419.5484 475.2425 513.7970 531.1872 567.5784 597.5664 629.0019 653.2502 702.0551 721.8821 733.7037 769.8612 796.3026 827.5928 843.2437 884.8716 904.0919 966.7467 994.9256 1006.8053 1020.2143 1026.5955 1055.6543 1089.1664 1099.4950 1150.7033 1157.4410 1194.9617 1212.7579 1252.1699 1273.9975 1291.9697 1309.5095 1342.2167 1375.9306 1397.7723 1401.3806 1456.2678 1476.1115 1485.8464 1489.6992 1599.3799 1607.3415 1643.7919 1653.5633 2980.9076 3013.7260 3061.1250 3079.3499 3091.4545 3151.7630 3158.2895 3173.4905 3177.1830 3448.4206 3489.4157 3569.3325
redmass: 4.1744 10.6296 4.9857 2.0059 5.3893 3.3077 2.5781 1.1722 2.3306 2.8886 3.8862 3.3333 3.8656 5.8283 4.5065 3.0802 3.4806 3.4431 3.2254 4.1148 1.7181 6.9874 2.6202 3.6198 1.8954 2.7799 1.5484 3.6028 1.2883 1.5180 3.3615 2.1589 1.3524 1.3095 2.9176 1.8805 2.6834 2.3283 2.1152 1.3207 2.1093 1.5689 2.1312 3.6999 1.7362 1.6057 1.2680 1.5520 1.3971 7.4184 1.2177 3.6540 1.0810 1.0539 2.5079 1.0434 7.9300 6.3758 9.0665 1.0967 1.0364 1.0633 1.0982 1.0978 1.1015 1.0883 1.0882 1.0961 1.0969 1.0461 1.0639 1.0953
irintensity: 0.2920 0.2807 0.3092 0.3906 0.3164 0.7990 3.0429 38.8962 3.0804 1.8155 0.2484 3.5712 27.6523 0.4574 1.2252 0.4403 3.3504 3.7057 18.0980 24.1008 120.7334 0.3591 25.9418 37.1946 131.7320 52.0600 26.7821 32.0352 12.8500 73.6856 32.6284 2.2756 1.7606 1.2558 20.5467 20.1196 168.5566 5.8410 16.1359 3.6005 9.9000 51.5271 11.5785 35.9403 8.9641 0.9597 2.9172 5.6256 3.4160 0.5097 10.9093 2.0978 4.4937 6.6061 134.3600 11.2043 6.2175 15.3199 234.9313 54.8527 31.8646 14.7672 14.2087 29.3670 34.1011 1.0469 0.1869 3.0863 9.0111 2.3780 15.3369 7.5361
temp: 298.150 k
press: 1.00000 atm
elementType: 9 8 8 7 6 6 6 6 6 6 6 6 6 6 1 1 1 1 1 1 1 1 1 1 1 1
symmnumber: 1
zpe: 534283.8 jmol-1
zpe.correction: 0.203498 hartree
zpe.thermalcorrener: 0.217320 hartree
zpe.thermalcorrenthalpy: 0.218264 hartree
zpe.thermalcorrgfe: 0.162873 hartree
zpe.sumelectzpe: -692.262586 hartree
zpe.sumelectthermal: -692.248764 hartree
zpe.sumelectthermalent: -692.247820 hartree
zpe.sumelectthermalfe: -692.303211 hartree
dipole: 3.0727 0.3520 -1.2646
dipole: 3.3414
quadrupole: -88.1065 -72.9143 -85.8870
quadrupole: 1.0268 -4.2677 -3.8753
quadrupole: -5.8039 9.3883 -3.5844 1.0268 -4.2677 -3.8753
hfenergy: -692.466084 hartree
pointgroup: C01 [X(C10H12F1N1O2)]
dipole: 1.1739964 -0.5307443 -0.261155 debye
dipolederiv: -1.2397962 0.0076646 -0.0417254 0.0018544 -0.1598186 -0.0149803 -0.060561 -0.0146173 -0.2060753 -0.4353568 0.0942089 0.0807044 0.063402 -0.5092796 -0.3165669 0.0491495 -0.4386132 -0.9066387 -0.4194598 -0.2677311 0.051112 -0.3121414 -0.9047192 -0.0769583 0.1603081 0.1228159 -0.5574872 -0.4919078 -0.0782639 0.0700969 -0.0932809 -0.3643173 -0.0552559 0.0184571 -0.0178532 -0.7139034 0.2404018 0.0270535 0.1792243 0.2081597 0.148259 0.1218045 0.1287016 0.0406318 0.4037938 0.0011898 -0.0225594 -0.0059667 -0.1439307 0.114332 -0.0679952 -0.0069701 -0.0102756 0.0437426 0.243577 -0.0260569 -0.0524538 -0.0662693 -0.1196382 0.0029968 0.0905036 0.018702 -0.2099497 0.3713221 0.3256802 -0.2391504 0.4242237 1.1422332 0.2404206 -0.3875392 0.1435938 1.0322572 -0.0746836 0.0563052 0.0004693 0.1264358 -0.0132592 0.0275076 -0.0118319 0.0189385 0.1123635 -0.0778997 -0.0112962 0.0136067 -0.0333085 -0.1144699 0.0442985 -0.0331013 0.0422544 0.0490289 -0.0276703 0.0022164 0.014457 -0.0102809 -0.1130707 0.0564132 -0.0126394 0.0477805 0.0318703 -0.2084528 -0.0124962 -0.0345066 -0.0589524 -0.1360956 0.0350461 -0.1936525 0.0435294 -0.039256 -0.2277473 0.0024856 0.0046232 0.0658917 -0.1464951 0.0401244 0.1699154 0.0423787 -0.0318498 1.3115474 -0.0075647 0.0503955 -0.0088041 0.1045429 0.0471393 0.0668484 0.0503868 0.2422873 0.0028681 -0.0220616 0.0810547 -0.0374238 0.0239899 0.0622827 0.0818117 0.0941213 -0.0337131 0.0164786 -0.0120679 -0.0765079 -0.0318242 0.0490914 -0.0476907 -0.0803157 -0.0824324 -0.0240955 0.0282139 0.0587951 -0.008255 0.1056212 -0.1576912 0.0012037 0.0053579 -0.0182062 0.0997586 0.0161517 -0.0243906 -0.0538436 -0.0661328 0.0589279 -0.108186 -0.1020089 -0.0764011 -0.1047867 0.0177318 -0.0513126 0.0602636 -0.084489 0.050708 0.0845298 0.1051029 0.0688296 -0.0463529 0.2597984 -0.0131725 -0.0814597 0.0308268 0.0674873 0.0017275 -0.0586384 0.0610512 0.2717634 0.0111361 0.0336016 -0.1026836 0.0056244 0.2234258 -0.0254554 0.0014015 -0.0147664 0.2777619 0.1760331 -0.0188484 -0.0438304 -0.0073076 0.1303054 -0.0280328 -0.0344655 -0.0336227 0.0282804 0.104882 0.035896 0.0580699 0.0248381 0.1256404 -0.0404644 0.062677 -0.0380904 0.0246369 0.0211638 0.0227877 0.0658029 0.0307672 0.1604129 -0.0524374 0.0756088 -0.0519655 0.0194482 0.0411458 -0.0162542 -0.057844 -0.0233971 0.1591346 -0.0552604 -0.073821 -0.0550512 0.0034016 0.339333 -0.0826187 0.0683468 -0.1101023 0.180364 0.123789 0.0397015 0.0568814 0.2337136 unknown
polarizability: 150.8426278|-1.83427|87.1492126|-2.1901648|10.3579328|115.8291087 unknown
InChI: InChI=1S/C10H12FNO2/c1-2-10(12,9(13)14)7-3-5-8(11)6-4-7/h3-6,13H,2,12H2,1H3
charge 0 multiplicity 1
26 atoms
F  -4.440914 -0.031571 -0.075084
O  1.964644 -0.104802 -2.110118
O  2.343721 1.846083 -0.924781
N  1.751505 0.591406 1.523072
C  1.320394 -0.081235 0.287743
C  1.771079 -1.577265 0.318102
C  -0.230756 -0.031635 0.158122
C  1.926704 0.668103 -0.939263
C  3.295404 -1.809218 0.395804
C  -1.011962 0.33903 1.279456
C  -0.885398 -0.411664 -1.043025
C  -2.422946 0.342738 1.212838
C  -2.294117 -0.414125 -1.128933
C  -3.031721 -0.03316 0.004883
H  1.269644 -2.0361 1.190761
H  1.373614 -2.071761 -0.584077
H  3.510703 -2.891987 0.350104
H  3.739308 -1.437336 1.338261
H  3.822129 -1.33036 -0.449467
H  1.707999 1.615451 1.452061
H  2.675487 0.285686 1.843031
H  -0.491058 0.605282 2.203383
H  -0.297375 -0.705523 -1.918115
H  -3.037392 0.626568 2.072418
H  -2.812387 -0.703204 -2.047924
H  2.332888 0.447499 -2.853654
