program: Gaussian 09
title: 000235532
version: EM64L-G09RevD.01
frameworkgroup: C1[X(C5H11NO3)]
method: RPBEPBE
basis: SDD
operation: Freq
keyword: #p
keyword: freq=noraman
keyword: PBEPBE/SDD
title: #p freq=noraman PBEPBE/SDD
converged: YES YES NO NO
title: Mulliken charges:
elementType: O O O N C C C C C H H H H H H H H H H H
charge: -0.437328 -0.421177 -0.233757 -0.649519 0.217125 -0.389333 -0.707387 -0.339200 0.118893 0.215959 0.205037 0.229156 0.233986 0.218879 0.253258 0.191840 0.271130 0.310077 0.328652 0.383709
chargesum: 0.00000
title: Mulliken charges with hydrogens summed into heavy atoms:
elementType: O O O N C C C C C
charge: -0.108676 -0.037468 -0.233757 -0.068312 0.217125 0.031663 -0.025366 0.105899 0.118893
polarizability: 7.29882339e+01 1.79569409e+00 7.01340190e+01 5.06823006e+00 -1.42458600e+00 6.98010153e+01
1716.lowfreq: -12.3846 -3.0516 -0.0007 0.0002 0.0004 9.9020 52.4914 76.2163 107.6774
frequency: 52.4566 76.1672 107.6010 160.5409 193.9035 228.4599 244.7492 262.3462 324.1459 338.2675 363.4874 365.5486 446.0281 504.3645 549.0971 573.4523 601.9695 708.2491 729.0890 803.9545 894.3259 926.7814 964.1276 1016.7433 1022.0656 1042.7429 1073.7469 1084.6840 1127.8956 1240.4397 1245.5851 1268.4349 1305.3965 1339.2594 1343.6919 1369.2091 1382.4424 1452.9441 1463.8736 1475.2107 1482.8763 1602.9555 1660.9636 2956.8685 2979.0363 2992.3696 3052.4332 3081.4254 3093.1632 3113.2319 3476.1154 3516.9880 3555.0283 3615.6030
redmass: 8.6779 4.0161 2.1853 3.2852 1.3480 1.9072 1.1924 3.0515 1.6353 1.8074 3.8457 2.8786 2.6620 3.1258 1.6251 2.6279 1.3630 3.7089 4.5256 1.2221 2.2992 2.4089 2.5099 1.5617 1.9946 3.0336 2.5851 1.7820 1.3820 2.9107 1.6841 1.4832 1.1858 1.4506 1.7236 1.2461 1.2918 1.0801 1.0545 1.0780 1.0812 1.3793 3.3562 1.0705 1.0341 1.0587 1.1016 1.1003 1.1010 1.0946 1.0449 1.0641 1.0662 1.0992
irintensity: 1.1535 2.3436 4.8407 0.0712 24.5625 4.6988 6.1521 0.2186 46.8677 57.9147 8.9065 42.9363 32.2759 33.2606 115.4241 50.8612 191.6833 34.9802 21.5624 14.4917 8.5249 22.7737 67.3758 27.1734 3.2129 227.6189 6.8859 33.4487 39.6815 7.1321 24.1030 17.8316 4.2158 15.1778 3.4699 16.4583 4.4377 1.6517 9.7758 11.7220 4.0892 170.5596 137.4093 57.1291 17.7169 35.0023 17.3059 28.2117 25.5006 17.0894 10.1359 29.7612 6.6244 12.3010
temp: 298.150 k
press: 1.00000 atm
elementType: 8 8 8 7 6 6 6 6 6 1 1 1 1 1 1 1 1 1 1 1
symmnumber: 1
zpe: 429773.6 jmol-1
zpe.correction: 0.163692 hartree
zpe.thermalcorrener: 0.174727 hartree
zpe.thermalcorrenthalpy: 0.175671 hartree
zpe.thermalcorrgfe: 0.127421 hartree
zpe.sumelectzpe: -476.801956 hartree
zpe.sumelectthermal: -476.790922 hartree
zpe.sumelectthermalent: -476.789978 hartree
zpe.sumelectthermalfe: -476.838228 hartree
dipole: -1.9333 0.1645 2.7630
dipole: 3.3762
quadrupole: -64.8570 -45.2171 -56.6130
quadrupole: -2.8071 2.0169 -3.9356
quadrupole: -9.2946 10.3452 -1.0506 -2.8071 2.0169 -3.9356
hfenergy: -476.9656485 hartree
pointgroup: C01 [X(C5H11N1O3)]
dipole: 0.7027259 -0.2402371 1.1012814 debye
dipolederiv: -0.9160755 0.1464593 0.0772319 0.1615501 -0.525433 0.1720691 0.1194563 0.1712697 -0.2119293 -0.381772 0.1005326 0.0275757 0.1525507 -0.6486011 -0.4345113 0.0474043 -0.409432 -0.8502175 -0.6126529 -0.1261644 0.3671527 -0.2602795 -0.5731761 0.1234772 0.2486673 -0.0774204 -0.7219797 -0.6072627 0.1544353 -0.1679779 0.1758785 -0.3515108 -0.0560376 -0.1377981 0.0074824 -0.7525717 0.2765091 -0.1912099 0.006386 -0.2030829 0.0239832 0.1473267 0.1013107 0.200671 0.4954947 -0.0848463 0.1247849 0.0327814 0.0961093 -0.0022501 0.0807855 -0.1225805 0.0455553 0.0083004 -0.0496437 -0.0160819 -0.0681948 0.0437128 -0.0151227 0.074255 -0.0637967 -0.054594 -0.0741972 0.6600616 -0.0352552 -0.0943581 -0.0657545 0.3730243 -0.033575 -0.0190879 -0.0525727 0.2381333 0.6655436 0.2728138 -0.5009282 0.3349824 1.0230451 0.2058835 -0.4221952 0.3410646 1.101264 0.0226992 -0.0759433 0.0139631 -0.0649222 -0.1326759 0.0245532 -0.0105669 0.0196549 0.077562 0.0586916 0.0156297 0.0152814 0.047214 0.0483639 -0.0793059 0.0126815 -0.0484633 -0.1289206 -0.1460079 0.063375 0.0230216 0.0326907 0.0796335 0.0155642 0.0640283 -0.0000553 0.0635529 0.0930892 0.0122561 0.0170123 0.0156326 0.0584741 -0.0867504 -0.0145615 -0.0552328 -0.1269392 0.0418459 -0.1046725 -0.0069461 -0.0855908 -0.1148188 0.0247715 -0.0162305 0.0123456 0.073749 0.0732984 -0.0199933 0.0056736 -0.0165762 0.0765514 -0.0614587 0.0008846 -0.0282626 -0.0631434 -0.0890962 -0.0938917 0.0324857 -0.1086938 -0.173835 0.0399075 0.006941 -0.0027727 0.0578072 0.3061278 -0.0325831 0.0995628 -0.0662976 0.0393556 -0.0225389 0.0755194 0.037239 0.2206677 0.1303561 -0.011486 0.1248756 -0.0272398 0.2592323 -0.032065 0.0393823 -0.0397307 0.2511696 0.3042532 -0.0515949 -0.0618475 -0.0596118 0.3168043 -0.127875 -0.0045726 -0.1414276 0.0233881 0.2548816 -0.1314106 0.0572489 -0.1022722 0.2389559 0.0255244 0.0951141 0.0746816 0.3188096 unknown
polarizability: 73.6358828|2.1437443|69.5238692|-4.5749274|1.7770009|69.7635162 unknown
InChI: InChI=1S/C5H11NO3/c1-5(6,2-3-7)4(8)9/h7-8H,2-3,6H2,1H3
charge 0 multiplicity 1
20 atoms
O  -3.29065 0.420082 -0.189836
O  0.90447 1.415326 1.097363
O  1.970684 1.015785 -0.92071
N  0.518051 -1.264767 -1.367768
C  0.428372 -0.706398 -0.008174
C  -1.064793 -0.527844 0.403979
C  1.157064 -1.588925 1.065099
C  -1.861141 0.383722 -0.544986
C  1.168857 0.639253 -0.037364
H  -1.537854 -1.529414 0.402979
H  -1.109284 -0.134955 1.437855
H  2.217833 -1.73231 0.791782
H  1.101754 -1.138335 2.071482
H  0.669753 -2.580883 1.098938
H  -1.827651 -0.017951 -1.568119
H  -1.434869 1.410084 -0.551769
H  0.317051 -2.264749 -1.431089
H  1.336926 -0.958408 -1.900907
H  -3.382682 0.799257 0.720999
H  1.448011 2.248127 1.054145
