program: Gaussian 09
title: 000235531
version: EM64L-G09RevD.01
frameworkgroup: C1[X(C11H11FN2O2)]
method: RPBEPBE
basis: SDD
operation: Freq
keyword: #p
keyword: freq=noraman
keyword: PBEPBE/SDD
title: #p freq=noraman PBEPBE/SDD
converged: YES YES NO NO
title: Mulliken charges:
elementType: F O O N N C C C C C C C C C C C H H H H H H H H H H H
charge: -0.202968 -0.212235 -0.224562 -0.451219 -0.396970 0.085046 -0.381907 0.445345 0.167694 0.157877 -0.700597 -0.375568 -0.318344 -0.368377 -0.390106 0.322093 0.231125 0.224418 0.329383 0.352469 0.241046 0.200553 0.234597 0.252005 0.262156 0.258583 0.258466
chargesum: 0.00000
title: Mulliken charges with hydrogens summed into heavy atoms:
elementType: F O O N N C C C C C C C C C C C
charge: -0.202968 -0.212235 -0.224562 -0.121837 -0.044501 0.085046 0.073636 0.445345 0.167694 0.157877 -0.024402 -0.123564 -0.056188 -0.109793 -0.131640 0.322093
polarizability: 1.65239211e+02 9.08736083e+00 1.20932174e+02 4.57051643e+00 1.83829067e+01 1.09906334e+02
1716.lowfreq: -10.9827 -2.3749 -0.0008 -0.0006 0.0003 7.3910 38.9993 52.3818 70.1549
frequency: 38.7335 52.3669 70.1427 98.2040 139.9383 160.5804 165.9245 186.9768 237.4547 284.1151 317.0251 321.5115 357.0215 398.4060 405.4187 413.5620 480.3271 499.5581 522.6781 580.5497 606.0619 617.8626 628.4247 641.6033 680.6977 710.0339 723.1210 741.7459 779.6331 797.7288 819.4871 834.5332 901.3838 941.7270 959.5855 961.6254 976.9479 1005.8339 1017.1740 1077.5350 1093.4793 1106.2435 1143.8277 1159.2529 1198.6629 1207.0121 1209.5904 1284.5086 1296.4246 1304.7230 1313.6873 1333.7835 1358.8212 1375.2639 1398.2288 1403.5874 1463.3360 1478.7513 1484.5624 1492.3077 1600.5833 1610.8516 1680.3997 1723.9585 2982.1958 3001.5682 3055.7004 3077.8085 3091.7338 3153.6752 3156.3765 3176.9772 3180.2769 3585.9232 3605.3493
redmass: 4.0376 7.8915 4.4933 3.3479 4.0274 4.7450 5.5276 2.0325 2.0267 6.7626 4.7493 3.9100 5.3504 5.0301 5.9803 3.1386 1.3445 2.5435 3.3383 4.7339 9.4566 4.1303 6.5632 1.3909 4.0218 3.5918 5.5258 4.4805 1.5053 4.6776 1.2568 1.6307 2.7078 1.4757 2.3062 1.5640 2.7305 2.8649 2.1660 3.1180 2.0307 1.4602 2.4871 1.5591 2.5848 2.5986 3.1874 1.4033 1.2630 2.8911 1.8813 1.7797 1.7200 7.2095 1.2423 3.4065 1.0748 1.0520 1.0463 2.5372 7.7773 6.3963 8.7017 9.4577 1.0375 1.0623 1.0985 1.0989 1.1005 1.0883 1.0889 1.0961 1.0971 1.0803 1.0796
irintensity: 0.1067 0.1133 0.6048 0.6744 0.2703 3.0096 1.2375 1.3277 1.9798 4.0301 0.9330 2.0999 1.7864 2.4000 12.4155 2.4428 72.9157 49.9248 19.2968 11.3510 12.6461 12.4767 1.8838 140.9563 6.1686 4.1269 37.7963 23.2594 35.6655 9.7103 0.9120 70.4384 17.0592 4.0597 4.8373 2.4119 23.6396 12.4546 6.0573 11.8119 2.9875 7.4256 7.9451 58.0781 18.6819 18.4727 87.1323 33.8953 3.6055 194.2444 17.4030 45.2503 9.8663 6.5266 14.7222 4.5835 12.0423 10.7520 8.7456 108.5793 9.8177 23.4053 483.5748 451.5842 25.1104 19.3243 3.0579 37.7141 36.7994 3.3564 2.9083 3.2627 2.0400 77.8198 34.9076
temp: 298.150 k
press: 1.00000 atm
elementType: 9 8 8 7 7 6 6 6 6 6 6 6 6 6 6 6 1 1 1 1 1 1 1 1 1 1 1
symmnumber: 1
zpe: 537976.6 jmol-1
zpe.correction: 0.204904 hartree
zpe.thermalcorrener: 0.219194 hartree
zpe.thermalcorrenthalpy: 0.220138 hartree
zpe.thermalcorrgfe: 0.163177 hartree
zpe.sumelectzpe: -784.447407 hartree
zpe.sumelectthermal: -784.433117 hartree
zpe.sumelectthermalent: -784.432173 hartree
zpe.sumelectthermalfe: -784.489134 hartree
dipole: -0.0582 2.0259 -1.9733
dipole: 2.8287
quadrupole: -109.2100 -93.4329 -92.2850
quadrupole: -5.1846 -2.3912 -3.7415
quadrupole: -10.9007 4.8764 6.0243 -5.1846 -2.3912 -3.7415
hfenergy: -784.6523111 hartree
pointgroup: C01 [X(C11H11F1N2O2)]
dipole: -0.0308401 -0.8006497 0.7723604 debye
polarizability: 165.2771883|-9.3033852|120.7936811|-4.1181484|18.3657053|110.0068496 unknown
InChI: InChI=1S/C11H11FN2O2/c1-2-11(9(15)13-10(16)14-11)7-3-5-8(12)6-4-7/h3-6,13-14H,2H2,1H3
charge 0 multiplicity 1
27 atoms
F  4.654756 0.725828 -0.073858
O  -1.276372 -0.979832 -2.347945
O  -3.547725 1.981776 0.532533
N  -1.763753 0.44276 0.890751
N  -2.556016 0.652327 -1.194606
C  -0.961606 -0.519745 0.111184
C  -1.205856 -1.989566 0.586715
C  0.538636 -0.164276 0.067222
C  -1.58462 -0.3407 -1.316023
C  -2.713538 1.131395 0.147208
C  -0.711774 -2.263736 2.021007
C  1.05785 0.945571 0.776701
C  1.42119 -0.960292 -0.710404
C  2.436862 1.251821 0.738274
C  2.79951 -0.667616 -0.765005
C  3.277341 0.431536 -0.030255
H  -0.701698 -2.664508 -0.128057
H  -2.290288 -2.198351 0.510602
H  -1.73392 0.522426 1.905133
H  -3.133969 0.996262 -1.962012
H  0.367496 -2.054217 2.123461
H  -1.255123 -1.655516 2.768867
H  -0.878423 -3.323034 2.284493
H  0.385525 1.588918 1.35217
H  1.027689 -1.792442 -1.302107
H  2.85059 2.105133 1.283119
H  3.489135 -1.267724 -1.365267
