program: Gaussian 09
title: 000235528
version: EM64L-G09RevD.01
frameworkgroup: C1[X(C9H14N2O2S)]
method: RPBEPBE
basis: SDD
operation: Freq
keyword: #p
keyword: freq=noraman
keyword: PBEPBE/SDD
title: #p freq=noraman PBEPBE/SDD
converged: YES YES NO NO
title: Mulliken charges:
elementType: S O O N N C C C C C C C C C H H H H H H H H H H H H H H
charge: 0.972842 -0.537484 -0.545584 -0.234483 -0.698888 -0.064121 -0.428110 -0.285682 0.325380 0.345847 -0.386126 -0.619285 -0.620813 -0.836023 0.280003 0.279842 0.237789 0.274465 0.245547 0.210341 0.276167 0.211996 0.245602 0.243388 0.229252 0.230569 0.329547 0.318021
chargesum: 0.00000
title: Mulliken charges with hydrogens summed into heavy atoms:
elementType: S O O N N C C C C C C C C C
charge: 0.972842 -0.537484 -0.545584 -0.234483 -0.051319 -0.064121 -0.148108 -0.005840 0.325380 0.345847 -0.148337 0.111068 0.112953 -0.132814
polarizability: 1.90828411e+02 -5.30752107e+00 1.48341386e+02 -1.90122670e-01 5.74122733e-01 1.06120499e+02
1716.lowfreq: -2.4320 -0.0016 -0.0005 0.0013 6.4063 15.7258 38.6360 54.6387 65.9378
frequency: 38.5426 54.4612 65.8315 119.1824 125.3696 180.1329 193.0788 207.1649 215.7229 226.9268 242.6788 248.6102 271.9312 288.5205 302.5419 309.9783 360.5653 382.3804 384.1468 423.2095 429.9674 446.1458 458.7540 484.6109 532.7967 595.1539 612.8445 723.5099 739.9007 805.9702 810.3993 856.9322 862.2131 880.8086 943.2284 952.0407 985.0859 1016.0995 1019.3244 1044.0133 1077.5125 1083.1366 1112.9542 1138.9882 1172.0175 1199.7291 1207.3105 1273.1269 1295.5657 1387.9101 1403.9537 1405.9702 1417.4346 1424.6260 1453.8715 1464.8220 1469.3285 1473.0746 1478.4495 1482.3427 1495.5274 1576.0572 1617.7003 1643.2411 2915.1965 2918.9704 2954.6194 3022.4339 3038.2562 3040.0771 3090.6033 3096.2232 3097.8001 3132.7440 3137.9443 3172.9356 3569.4131 3708.5048
redmass: 3.8104 3.5660 3.1751 3.6034 6.3312 1.1244 2.6182 5.0879 1.3661 2.4948 2.5305 1.7020 5.6958 2.6670 2.7977 3.7758 1.2590 4.2295 2.9510 1.2809 4.8976 3.2330 3.6500 5.4045 5.0912 5.4256 6.2534 3.0835 4.2864 6.9333 1.4149 4.3641 5.5459 1.5032 1.3551 11.2136 1.6029 1.4366 1.7191 1.5289 1.6991 1.2334 1.3738 1.2938 5.1035 3.4144 1.6764 1.3386 2.2454 2.1257 1.9257 1.1333 1.1400 3.1117 1.0474 1.0499 1.0469 1.0445 1.0582 1.2007 3.2718 7.4561 4.1264 1.2991 1.0468 1.0460 1.0397 1.0974 1.0872 1.0854 1.0954 1.0982 1.0995 1.0898 1.0913 1.0950 1.0452 1.1036
irintensity: 1.4808 1.7536 0.5064 0.2243 1.3675 2.5322 0.4647 0.6469 2.0942 4.4739 7.9688 3.3677 1.2426 1.7908 0.7137 1.9370 157.3358 4.4936 11.6006 98.5067 68.1179 13.7507 8.3657 79.7585 15.1741 30.6157 24.5129 0.5136 0.5832 102.6888 9.5234 38.1657 14.6874 22.4977 1.5826 59.4327 17.8067 0.7574 1.7557 5.8087 33.7911 0.6594 20.8922 13.4058 11.9274 5.2476 13.3068 4.2432 20.2301 9.1482 25.9565 23.6268 2.8919 32.2219 22.7486 1.7741 19.4650 14.4050 45.7053 13.6932 98.7567 5.8838 34.2176 230.1794 28.2828 88.9867 39.7659 23.1925 5.0809 46.5995 13.0308 2.2010 3.0910 14.5509 8.1690 4.6084 70.8346 25.8990
temp: 298.150 k
press: 1.00000 atm
elementType: 16 8 8 7 7 6 6 6 6 6 6 6 6 6 1 1 1 1 1 1 1 1 1 1 1 1 1 1
symmnumber: 1
zpe: 577145.2 jmol-1
zpe.correction: 0.219823 hartree
zpe.thermalcorrener: 0.235870 hartree
zpe.thermalcorrenthalpy: 0.236814 hartree
zpe.thermalcorrgfe: 0.177099 hartree
zpe.sumelectzpe: -1008.119407 hartree
zpe.sumelectthermal: -1008.103360 hartree
zpe.sumelectthermalent: -1008.102416 hartree
zpe.sumelectthermalfe: -1008.162132 hartree
dipole: -6.8623 0.6840 5.3957
dipole: 8.7563
quadrupole: -84.3049 -84.2847 -98.0373
quadrupole: -6.0617 11.5897 0.2896
quadrupole: 4.5707 4.5910 -9.1617 -6.0617 11.5897 0.2896
hfenergy: -1008.3392302 hartree
pointgroup: C01 [X(C9H14N2O2S1)]
dipole: -2.7118997 0.3381345 2.0974286 debye
polarizability: 190.9721911|-4.6845862|148.1440863|0.3820039|-1.6012151|106.1740188 unknown
InChI: InChI=1S/C9H14N2O2S/c1-7-4-5-8(6-9(7)10)14(12,13)11(2)3/h4-6H,10H2,1-3H3
charge 0 multiplicity 1
28 atoms
S  1.939291 0.120618 -0.761555
O  2.517876 -1.224008 -1.467733
O  2.072914 1.603917 -1.418562
N  2.866074 0.239891 0.897549
N  -2.957308 1.886097 0.002212
C  0.101835 -0.164012 -0.393157
C  -0.720548 0.967282 -0.329298
C  -0.351243 -1.480509 -0.212972
C  -2.615217 -0.54285 0.15368
C  -2.105458 0.784568 -0.055582
C  -1.729851 -1.6398 0.064328
C  2.404644 1.420037 1.664038
C  2.807454 -1.051216 1.620897
C  -4.089175 -0.747196 0.444625
H  -0.300673 1.960171 -0.52846
H  0.32356 -2.333381 -0.324574
H  -2.130249 -2.650296 0.207177
H  2.379767 2.292546 0.990339
H  3.157275 1.615327 2.44952
H  1.410718 1.286313 2.148865
H  3.050127 -1.863998 0.916436
H  1.827638 -1.253465 2.110088
H  3.592719 -1.027133 2.39839
H  -4.322872 -1.815485 0.581786
H  -4.403255 -0.218995 1.367732
H  -4.726419 -0.375178 -0.38347
H  -3.952555 1.772589 0.165947
H  -2.604268 2.821668 -0.17755
