program: Gaussian 09
title: 000235521
version: EM64L-G09RevD.01
frameworkgroup: C1[X(C8H12N2O2S)]
method: RPBEPBE
basis: SDD
operation: Freq
keyword: #p
keyword: freq=noraman
keyword: PBEPBE/SDD
title: #p freq=noraman PBEPBE/SDD
converged: YES YES NO NO
title: Mulliken charges:
elementType: S O O N N C C C C C C C C H H H H H H H H H H H H
charge: 0.923293 -0.542620 -0.539906 -0.484996 -0.699732 -0.182460 0.482405 -0.478774 -0.371239 0.536466 -0.812603 -0.425687 -0.602764 0.300225 0.235855 0.214028 0.267545 0.271791 0.315937 0.222978 0.251712 0.251707 0.238899 0.310586 0.317355
chargesum: 0.00000
title: Mulliken charges with hydrogens summed into heavy atoms:
elementType: S O O N N C C C C C C C C
charge: 0.923293 -0.542620 -0.539906 -0.169060 -0.071791 -0.182460 0.482405 -0.178549 -0.135384 0.536466 -0.059239 -0.202709 0.139553
polarizability: 1.68118961e+02 1.04327095e+01 1.44193807e+02 -2.14554011e+00 3.21012487e+00 9.25739688e+01
1716.lowfreq: -8.7526 -4.7502 -0.0010 0.0005 0.0018 7.3986 41.9823 55.5348 113.8334
frequency: 41.9457 55.5185 113.8307 118.4723 140.4038 155.1841 159.4667 172.9093 226.8245 243.9297 256.7389 294.0934 318.5264 321.4845 360.9481 386.7997 389.5586 406.5102 441.4149 460.8307 463.7541 486.1027 593.3359 667.1019 705.6969 749.6369 796.8547 816.3834 823.1915 865.3720 893.3946 924.1990 949.2370 986.0823 1000.6975 1005.6619 1042.4497 1055.1075 1092.2436 1107.3458 1155.0350 1216.5700 1268.7552 1317.9611 1326.0377 1365.7372 1405.6702 1414.6897 1431.9365 1448.7226 1459.6023 1483.4032 1487.2775 1509.7713 1558.7848 1636.3414 1647.5839 2970.2864 2986.3096 3065.0689 3070.3914 3094.1170 3094.9128 3122.4005 3134.7061 3146.0449 3351.9536 3567.6102 3707.5632
redmass: 3.6722 3.8661 2.2845 1.6684 1.9124 2.3636 1.5809 5.3911 5.6105 4.3861 4.8565 7.4913 3.2456 3.4904 1.1306 3.7795 1.2846 5.9461 3.8944 4.4027 3.7000 4.6453 4.3168 7.0429 2.7735 4.6230 14.1352 1.3384 1.4102 5.9227 1.5002 10.2827 1.3525 1.7183 3.2415 2.2967 1.3653 1.4873 1.3765 1.4822 1.2419 1.9966 1.7129 2.6186 1.1999 3.6207 1.2089 1.1316 3.9836 1.0436 1.0437 1.0924 1.0626 3.9010 5.6978 2.0601 1.9251 1.0351 1.0364 1.0990 1.0974 1.1003 1.1007 1.0873 1.0913 1.0966 1.0747 1.0451 1.1041
irintensity: 3.2903 0.8716 1.4112 3.1388 1.1470 0.3322 1.9967 2.6622 12.5935 4.4269 2.0624 4.1633 3.4800 2.3713 55.0382 56.3789 205.4920 40.4756 42.5911 8.6102 5.2047 116.9189 1.2494 3.4695 4.0637 7.5351 74.6893 87.5883 33.1466 15.1737 33.5071 70.6269 0.3295 2.8981 3.0469 1.3739 3.4650 9.9627 6.0328 14.6210 23.4056 6.0033 1.0079 46.1455 6.5083 13.4145 13.8244 7.4027 7.8474 11.7090 16.1968 26.1714 11.7956 154.9245 13.5434 1.0876 299.4858 38.8408 23.1537 13.2885 4.8108 16.4290 15.0253 13.2269 9.9159 29.5244 11.1487 83.1413 23.8285
temp: 298.150 k
press: 1.00000 atm
elementType: 16 8 8 7 7 6 6 6 6 6 6 6 6 1 1 1 1 1 1 1 1 1 1 1 1
symmnumber: 1
zpe: 505628.5 jmol-1
zpe.correction: 0.192584 hartree
zpe.thermalcorrener: 0.207332 hartree
zpe.thermalcorrenthalpy: 0.208277 hartree
zpe.thermalcorrgfe: 0.151334 hartree
zpe.sumelectzpe: -968.901672 hartree
zpe.sumelectthermal: -968.886923 hartree
zpe.sumelectthermalent: -968.885979 hartree
zpe.sumelectthermalfe: -968.942921 hartree
dipole: -4.2000 -0.6420 4.1021
dipole: 5.9059
quadrupole: -66.3948 -80.8518 -92.2459
quadrupole: 5.4615 10.0378 -1.1580
quadrupole: 13.4360 -1.0209 -12.4151 5.4615 10.0378 -1.1580
hfenergy: -969.0942556 hartree
pointgroup: C01 [X(C8H12N2O2S1)]
dipole: -1.7325275 -0.1284142 1.5429566 debye
dipolederiv: 1.7748214 -0.1808859 0.1850776 -0.204545 1.2146266 -0.0235953 0.0770953 -0.038504 1.3970378 -0.696412 0.0694148 -0.0611988 0.0381597 -0.7072087 -0.1598427 -0.0189044 -0.0171501 -0.5614694 -0.7189364 0.0055838 0.0824758 0.0423693 -0.5493224 0.1509329 0.0060274 0.0688122 -0.6420525 -0.4566793 0.0132972 -0.1128993 0.0018238 -0.5468374 0.0103612 -0.0539752 -0.0141343 -0.4626736 -0.9054822 -0.6965062 -0.1016199 -0.8048243 -0.8477686 0.0524936 -0.0652539 0.0829017 -0.7155623 0.060061 0.0637577 0.0210396 -0.1651489 0.1610953 0.0486678 0.0001637 0.0546248 -0.1841227 -0.2725589 0.3809512 0.0382173 0.033432 -0.0543684 -0.0182874 0.0312353 -0.0537889 -0.0310709 -0.4291786 -0.4974178 -0.0632335 0.3215672 -0.2497635 -0.0044634 0.0641116 0.0455222 -0.1759085 0.2095878 -0.223044 -0.0506353 0.1945868 0.0667833 0.0223835 -0.0178885 0.0537161 -0.1156241 0.8572469 0.9200581 0.0771601 0.9134601 0.7845988 0.0191758 0.0429604 -0.0035402 0.1487979 -0.0961925 -0.1432065 -0.0201904 -0.0737578 0.0117684 0.0267609 0.0127416 0.0293308 0.0036154 0.0126558 0.0338159 -0.0278902 -0.4722896 -0.2237949 0.0308924 -0.0859646 -0.010756 -0.2011643 0.0216265 0.047244 -0.2015896 -0.1163749 0.2472744 -0.1646511 -0.0297053 -0.0148155 0.1070542 0.1732808 0.0126289 0.0196396 -0.0284863 0.0290452 -0.018925 0.0077932 -0.0181091 0.1593919 0.040417 0.0430466 0.0109186 0.0661618 -0.0929616 -0.0357281 0.0208691 -0.0379782 0.1411086 0.0219583 0.1678824 0.0270141 0.0476982 -0.1085911 -0.0336284 0.0137511 -0.0567357 0.1089527 0.0117417 -0.0501897 -0.0779278 -0.0242254 0.0848038 0.0382111 -0.095597 -0.0005727 0.0132311 0.0662179 -0.0709932 0.0679746 -0.0496142 0.0869037 -0.0365584 0.0705024 0.0320563 -0.0077001 0.0556045 -0.0013579 0.0475616 0.0530279 0.235152 0.047105 -0.0185219 0.0753473 0.0315645 -0.1433185 0.0283449 0.0300351 0.0105942 0.0796264 -0.0126406 0.0344517 -0.0148639 0.1591906 0.0782463 0.0502776 0.0416375 0.1232457 -0.1142363 0.0745353 0.0468098 -0.0620543 0.0600576 -0.0829865 -0.0330874 0.0929631 0.0067154 0.0597882 0.0341032 0.0468362 -0.0060365 0.099808 0.0744588 -0.027477 -0.0788682 -0.014538 0.0720336 0.023345 -0.1238837 -0.0052745 -0.0860646 0.1951575 0.055721 0.0236643 0.0310196 0.1507257 -0.0376935 0.0084691 -0.0453045 0.3793649 0.1486629 0.0321412 0.0306745 0.0699429 0.2106274 -0.0329538 0.0258764 -0.042693 0.3742378 unknown
polarizability: 168.9268296|9.3511509|143.6219116|1.0910245|1.757376|92.3379962 unknown
InChI: InChI=1S/C8H12N2O2S/c1-6-3-4-7(9)5-8(6)13(11,12)10-2/h3-5,10H,9H2,1-2H3
charge 0 multiplicity 1
25 atoms
S  1.675306 -0.415693 -0.480519
O  1.658799 -2.034485 -0.721449
O  2.441034 0.556592 -1.539641
N  2.474275 -0.004072 1.176786
N  -3.372245 -1.668857 -0.105345
C  -0.120393 0.118133 -0.182043
C  -0.437485 1.479274 0.028161
C  -1.039098 -0.93874 -0.237287
C  -1.826441 1.726254 0.204989
C  -2.421455 -0.650832 -0.060058
C  0.580624 2.600994 0.070691
C  -2.795743 0.705629 0.165637
C  2.348999 -1.115779 2.157049
H  -0.677901 -1.956521 -0.425283
H  -2.149178 2.759697 0.377137
H  0.084199 3.562807 0.282143
H  1.338637 2.413017 0.852822
H  1.125395 2.684438 -0.88634
H  3.460438 0.191441 0.910816
H  -3.853642 0.958302 0.306154
H  2.737845 -2.088514 1.797148
H  1.288988 -1.235396 2.43652
H  2.90586 -0.811763 3.061798
H  -4.360989 -1.461782 -0.001153
H  -3.099631 -2.628447 -0.296332
