program: Gaussian 09
title: 000235513
version: EM64L-G09RevD.01
frameworkgroup: C1[X(C8H8N2)]
method: RPBEPBE
basis: SDD
operation: Freq
keyword: #p
keyword: freq=noraman
keyword: PBEPBE/SDD
title: #p freq=noraman PBEPBE/SDD
converged: YES YES NO NO
title: Mulliken charges:
elementType: N N C C C C C C C C H H H H H H H H
charge: -0.017198 -0.017247 0.230779 0.230579 -0.332111 -0.331859 -0.324050 -0.323812 -0.477072 -0.477205 0.242374 0.242435 0.255521 0.255515 0.223518 0.198173 0.223494 0.198168
chargesum: 0.00000
title: Mulliken charges with hydrogens summed into heavy atoms:
elementType: N N C C C C C C C C
charge: -0.017198 -0.017247 0.230779 0.230579 -0.089737 -0.089425 -0.068529 -0.068298 -0.055382 -0.055543
polarizability: 1.93683293e+02 5.24464116e-03 9.55070162e+01 6.04061266e-04 -3.10746427e+00 4.63967562e+01
1716.lowfreq: -10.7947 -4.4026 -0.0007 -0.0003 0.0008 1.6247 82.3161 111.3367 151.6126
frequency: 82.3153 111.3363 151.6038 209.0616 236.2013 318.1998 358.7493 412.7184 444.9455 507.7011 547.0188 623.5600 662.5661 710.5512 713.9212 786.8404 807.0118 820.8283 864.7020 941.2018 974.0492 997.7058 1041.6187 1042.1428 1106.5648 1154.0008 1171.9432 1173.7947 1182.0859 1200.2868 1292.4993 1355.2750 1419.6427 1457.7239 1478.2666 1494.6427 1557.2467 1596.2511 1623.1465 1627.4587 2961.3552 2961.4327 3125.4831 3128.5451 3129.4175 3148.3034 3152.1944 3174.0370
redmass: 3.9648 3.1917 3.4625 3.2727 3.2349 2.6569 4.7575 2.9911 3.2697 3.7012 2.5633 4.8709 2.9621 3.1120 1.2984 2.1254 5.4530 1.3155 1.7231 1.3716 1.3586 2.7294 1.3525 1.3537 1.3115 1.7206 1.6123 1.4775 2.2092 2.0427 1.2864 5.5533 4.0585 1.5819 1.2482 1.6460 7.3249 5.8974 4.9864 5.0024 1.0656 1.0655 1.0891 1.1029 1.1022 1.0966 1.0881 1.0977
irintensity: 1.8203 10.1579 10.5913 13.1091 16.9755 10.8462 0.9848 11.2202 13.5063 0.7971 10.9126 1.4019 21.3886 0.0040 14.9065 0.9610 0.4458 9.0168 67.5202 0.5622 0.6053 0.9090 76.4573 18.1410 10.9602 2.7308 0.3760 2.6351 13.9872 3.1051 1.6289 0.0349 2.2380 21.8814 13.2458 21.1789 1.2675 2.2883 1.2228 3.2905 19.7267 95.3632 31.0943 9.6800 27.4262 11.8482 2.6398 7.0052
temp: 298.150 k
press: 1.00000 atm
elementType: 7 7 6 6 6 6 6 6 6 6 1 1 1 1 1 1 1 1
symmnumber: 1
zpe: 365089.2 jmol-1
zpe.correction: 0.139055 hartree
zpe.thermalcorrener: 0.147933 hartree
zpe.thermalcorrenthalpy: 0.148877 hartree
zpe.thermalcorrgfe: 0.105155 hartree
zpe.sumelectzpe: -418.389418 hartree
zpe.sumelectthermal: -418.380541 hartree
zpe.sumelectthermalent: -418.379596 hartree
zpe.sumelectthermalfe: -418.423318 hartree
dipole: -0.0005 -2.6953 1.5483
dipole: 3.1083
quadrupole: -53.6976 -52.8402 -62.1911
quadrupole: 0.0078 0.0174 0.8130
quadrupole: 2.5454 3.4028 -5.9482 0.0078 0.0174 0.8130
hfenergy: -418.5284734 hartree
pointgroup: C01 [X(C8H8N2)]
dipole: -0.0007036 -0.7658191 -0.953431 debye
dipolederiv: -0.3704327 -0.0014454 -0.0470165 -0.2353829 -0.3116724 -0.0734944 -0.0083178 -0.08321 -0.302385 -0.3693408 0.0015805 0.0468676 0.2343574 -0.31073 -0.0740507 0.0053395 -0.082785 -0.3029302 0.4222237 0.0016048 0.0062723 0.0299542 0.0718869 0.006312 -0.1771412 0.0288983 0.0500889 0.421957 -0.0013805 -0.0070159 -0.0285216 0.0715762 0.0062564 0.1772753 0.0289261 0.0495673 -0.1196389 -0.0118492 -0.0101751 -0.1718567 0.0179198 -0.0173675 0.1577288 -0.0021925 -0.1663055 -0.1200761 0.0117828 0.0101022 0.1711934 0.0184169 -0.017499 -0.1574887 -0.0019043 -0.1656209 -0.0594717 0.0481595 0.0268711 0.1763764 0.0659079 0.0831071 -0.1281203 0.0418812 -0.1174839 -0.0591461 -0.0481759 -0.027217 -0.1764541 0.0654573 0.0834541 0.1279302 0.0420619 -0.1176545 0.2359745 -0.0085718 0.0440945 0.2088745 0.0367966 0.3083413 0.1287148 0.2702203 0.1904876 0.235769 0.008053 -0.0433025 -0.2103215 0.0354613 0.3083634 -0.1253285 0.2700058 0.1918904 0.0036801 0.0885231 0.0026177 0.0666016 -0.0282938 -0.0224571 0.0187299 -0.0214704 0.1563879 0.0041298 -0.0883818 -0.0023122 -0.0666836 -0.0284993 -0.0224346 -0.0185085 -0.0214456 0.1564592 0.0491517 -0.0834714 -0.030486 -0.0598138 -0.0081008 -0.0425662 -0.0237261 -0.0368583 0.1509311 0.0491164 0.0835494 0.030857 0.0598007 -0.0077815 -0.0426333 0.0241517 -0.0370344 0.1507479 -0.1661326 0.0159083 0.0095536 -0.0384274 0.0987443 -0.0434771 0.0391752 -0.0275932 0.0913301 0.0042787 -0.0684791 -0.0940752 0.1060557 0.0568206 -0.1985376 -0.0599553 -0.1697542 -0.0529552 -0.166456 -0.0156685 -0.0093126 0.0394413 0.0989789 -0.0433845 -0.0396566 -0.0276757 0.0911501 0.0044139 0.068262 0.0936769 -0.1051935 0.0571111 -0.1979323 0.0591977 -0.1700699 -0.0537052 unknown
polarizability: 193.6830544|0.0575026|86.8892703|-0.1778256|18.936966|55.0147404 unknown
InChI: InChI=1S/C8H8N2/c1-9-7-3-5-8(10-2)6-4-7/h3-6H,1-2H2
charge 0 multiplicity 1
18 atoms
N  2.847825 0.332785 0.0897
N  -2.847316 0.330026 0.097257
C  1.424257 0.266232 0.045914
C  -1.423545 0.263916 0.049455
C  0.704583 -0.936282 -0.206748
C  -0.703265 -0.937433 -0.204934
C  0.701978 1.453452 0.34994
C  -0.702085 1.4522 0.351601
C  3.58825 -0.342158 -0.74033
C  -3.589209 -0.344662 -0.731565
H  1.251842 -1.873792 -0.359532
H  -1.249064 -1.875923 -0.357045
H  1.267298 2.359829 0.587453
H  -1.268566 2.357478 0.590617
H  4.679945 -0.297473 -0.62471
H  3.191448 -0.955454 -1.575665
H  -4.680888 -0.297619 -0.615953
H  -3.194586 -0.95752 -1.568252
