program: Gaussian 09
title: 000235500
version: EM64L-G09RevD.01
frameworkgroup: C1[X(C21H30O3)]
method: RPBEPBE
basis: SDD
operation: Freq
keyword: #pfreq=noraman
keyword: PBEPBE/SDD
title: #p freq=noraman PBEPBE/SDD
converged: YES YES NO NO
title: Mulliken charges:
elementType: O O O C C C C C C C C C C C C C C C C C C C C C H H H H H H H H H H H H H H H H H H H H H H H H H H H H H H
charge: -0.290594 -0.208691 -0.213899 0.301675 0.371626 -0.106602 -0.147629 -0.113933 0.385751 -0.324055 -0.575919 -0.491868 -0.529947 -0.476228 -0.533936 -0.230822 -0.555884 -0.822155 -0.477234 -0.563063 0.190155 -0.824753 0.159032 -0.802316 0.213207 0.228369 0.212694 0.245836 0.227298 0.231510 0.228912 0.216771 0.230677 0.208214 0.204428 0.237940 0.201513 0.207506 0.233164 0.211467 0.234783 0.220980 0.244380 0.220883 0.263287 0.211030 0.246763 0.252183 0.226040 0.222550 0.252589 0.243147 0.248339 0.254830
chargesum: 0.00000
title: Mulliken charges with hydrogens summed into heavy atoms:
elementType: O O O C C C C C C C C C C C C C C C C C C C C C
charge: -0.290594 -0.208691 -0.213899 0.301675 0.371626 0.106604 0.080739 0.098762 0.385751 -0.078219 -0.117111 -0.046184 -0.091056 -0.033860 -0.124917 0.002342 -0.109634 -0.135913 -0.002918 -0.064117 0.190155 -0.123574 0.159032 -0.056000
polarizability: 2.55688842e+02 -7.86555923e-01 2.07948358e+02 -7.36530075e+00 3.42588523e+00 1.93904177e+02
1716.lowfreq: -8.4390 -0.0006 -0.0002 0.0006 0.7914 14.9583 30.1252 38.1599 55.8857
frequency: 30.0620 37.7742 55.7057 62.2582 82.5729 99.7312 106.8181 130.7765 156.2090 167.4250 189.4807 198.3300 224.8410 232.3268 247.4828 254.8721 264.6452 266.7727 281.0727 305.2559 328.5721 337.8570 349.0998 359.9792 367.3658 395.0514 413.5748 418.2566 428.8716 454.1991 469.4571 491.6972 506.6038 526.0827 539.3194 558.5464 579.2160 585.3267 623.7351 629.1722 653.3817 667.1264 705.2633 758.7089 761.9585 805.0926 809.9811 820.5015 830.4075 837.5409 854.8887 893.7244 907.8224 914.6055 919.5968 928.1308 940.8211 945.5107 968.2883 979.6979 988.3502 998.1991 1004.7997 1024.9197 1025.9480 1032.8582 1044.3040 1048.4131 1054.8806 1074.9072 1079.2576 1095.8898 1107.1668 1116.7444 1124.8482 1130.8502 1138.4299 1154.1324 1174.1185 1178.4612 1188.4033 1193.6798 1206.7889 1211.1051 1223.0920 1231.3463 1236.4305 1243.9266 1249.7855 1262.2051 1267.1803 1279.2882 1289.0416 1294.8869 1297.4937 1311.4048 1321.0838 1321.9960 1326.7782 1329.0842 1330.9063 1335.0613 1340.2254 1345.2966 1353.3445 1364.5018 1368.3267 1382.7416 1396.3689 1400.8910 1431.2995 1442.2052 1450.1146 1457.0243 1464.8153 1465.5503 1467.1268 1472.8177 1474.0456 1477.9667 1486.6401 1490.4549 1492.1266 1494.4844 1607.4882 1622.1043 2907.6271 2916.6473 2949.2656 2959.3044 2971.6856 2973.8725 2977.3454 2980.5113 2986.4510 2989.2404 2991.5319 2993.8290 2998.5702 3005.8813 3013.3668 3014.1809 3039.7859 3041.2760 3042.5654 3049.0743 3057.3255 3060.5310 3061.3074 3076.3408 3076.5662 3078.9155 3092.5627 3095.7225 3107.6158 3118.6864
redmass: 7.6525 4.0572 4.8645 3.6777 3.1848 1.2599 2.4791 2.4483 2.8132 2.4468 2.2794 2.8082 1.7489 1.1779 2.2261 3.0822 3.1604 3.0358 2.4112 2.5929 2.9110 3.4646 2.7977 2.6962 3.4547 2.9952 3.6167 4.1066 3.5552 3.5865 3.5598 2.7185 3.7014 2.5756 2.6630 2.5236 3.6301 3.4205 2.7996 3.8568 2.8779 3.1973 2.1985 3.5662 2.5460 2.4172 2.4204 2.9124 1.9644 2.3187 2.1999 1.9346 2.2059 2.2180 2.7954 1.8119 1.8533 2.0439 1.8960 2.0113 1.7021 2.0534 1.8429 1.7702 2.1978 1.8768 1.8537 1.9260 2.0294 2.4524 2.4683 1.6995 1.8285 2.1331 2.1217 1.6652 1.9643 1.9275 2.0471 1.8431 2.0173 1.9240 1.7667 1.2808 1.7502 1.9602 1.3509 1.4903 1.5526 2.0086 1.6302 1.3303 1.4405 1.3441 1.5835 1.4730 1.4670 1.5183 1.3938 1.3547 1.4713 1.4729 1.5978 1.4446 1.4650 1.2475 1.5600 2.9349 1.2330 1.1985 1.0869 1.0735 1.0590 1.0746 1.0845 1.0777 1.0792 1.0765 1.0866 1.0740 1.0564 1.0662 1.0789 1.0617 10.3422 7.3397 1.0818 1.0801 1.0614 1.0699 1.0762 1.0723 1.0486 1.0641 1.0566 1.0419 1.0547 1.0457 1.0613 1.0630 1.0787 1.0791 1.0966 1.0968 1.0979 1.1007 1.1025 1.0945 1.1012 1.0991 1.1001 1.1006 1.0975 1.0987 1.0901 1.1006
irintensity: 4.0105 4.3002 0.1985 1.9675 2.1994 2.3675 1.6800 0.7524 0.1927 1.3061 0.4878 0.3446 0.2766 0.1540 3.4465 0.7506 1.2684 1.4223 2.7192 0.7840 0.0124 1.4483 0.6509 2.7169 10.1092 3.4277 2.5643 1.6150 3.2041 1.1041 4.7507 1.6839 7.8175 0.4991 1.3459 3.2565 11.6528 3.4465 0.0919 9.2734 3.3318 1.5335 3.9460 4.1079 14.2764 2.7490 2.4209 22.1268 1.0751 2.9190 8.6273 1.6906 2.5432 1.7230 2.0995 4.2035 1.9377 10.3915 8.0993 0.8304 6.1165 0.4385 0.2504 3.7977 0.2320 1.4451 5.5016 1.4126 2.9779 6.2842 1.2542 3.7348 0.6885 8.5184 1.0676 5.8291 7.8384 28.1263 24.0568 7.7565 7.9450 10.7249 40.4966 15.6923 0.8276 5.5388 13.4422 25.4012 4.6524 20.7098 19.0376 5.5844 7.6299 0.6458 5.0584 4.6170 1.5594 3.8929 0.7688 1.4007 11.8662 16.8933 8.1501 3.1822 1.6402 65.4483 19.4958 12.9523 15.3302 37.4121 14.1614 15.6232 10.7055 5.8760 5.3888 18.9080 13.2496 7.6975 17.9546 5.1324 8.4661 4.9575 12.2357 4.4709 191.7222 107.0236 3.9106 23.2716 34.2152 8.3994 7.7888 32.9612 20.1508 15.1925 13.9133 16.3803 28.1775 31.3576 20.6775 25.7260 72.2469 19.9121 22.3955 19.5209 54.2475 25.3490 32.2548 9.6527 15.7079 31.5621 25.8127 38.3058 34.2097 21.4431 12.9278 16.5931
temp: 298.150 k
press: 1.00000 atm
elementType: 8 8 8 6 6 6 6 6 6 6 6 6 6 6 6 6 6 6 6 6 6 6 6 6 1 1 1 1 1 1 1 1 1 1 1 1 1 1 1 1 1 1 1 1 1 1 1 1 1 1 1 1 1 1
symmnumber: 1
zpe: 1223680.7 jmol-1
zpe.correction: 0.466075 hartree
zpe.thermalcorrener: 0.488934 hartree
zpe.thermalcorrenthalpy: 0.489878 hartree
zpe.thermalcorrgfe: 0.415405 hartree
zpe.sumelectzpe: -1042.027244 hartree
zpe.sumelectthermal: -1042.004385 hartree
zpe.sumelectthermalent: -1042.003441 hartree
zpe.sumelectthermalfe: -1042.077914 hartree
dipole: -1.6383 -0.8257 0.7830
dipole: 1.9947
quadrupole: -191.8422 -137.7925 -150.3895
quadrupole: 8.6958 17.8054 -5.2919
quadrupole: -31.8341 22.2155 9.6186 8.6958 17.8054 -5.2919
hfenergy: -1042.4933191 hartree
pointgroup: C01 [X(C21H30O3)]
dipole: -0.6433443 -0.3579937 0.2717316 debye
polarizability: 255.8339023|0.3726236|207.2450361|-6.8225265|4.5187022|194.4624377 unknown
InChI: InChI=1S/C21H30O3/c1-12(22)14-4-5-15-13-6-11-21-18(24-21)17(23)8-10-20(21,3)16(13)7-9-19(14,15)2/h13-16,18H,4-11H2,1-3H3
charge 0 multiplicity 1
54 atoms
O  4.340504 0.803287 0.548227
O  4.329783 -1.029026 -2.54659
O  -5.715378 -0.089979 0.318952
C  2.059882 -0.294468 1.011738
C  2.847961 0.853912 0.339828
C  0.663454 -0.356709 0.280039
C  -0.072276 1.028661 0.293163
C  -1.402823 0.884192 -0.474185
C  -2.355157 -0.205797 0.122763
C  3.750975 0.544491 -0.834084
C  2.199522 2.2281 0.378911
C  0.816104 2.144672 -0.312766
C  -0.252996 -1.499683 0.796464
C  2.88285 -1.614599 0.877275
C  -1.619703 -1.566738 0.060243
C  -3.580032 -0.033189 -0.871117
C  -2.313513 2.122026 -0.650604
C  1.925281 -0.002895 2.533053
C  -3.698937 1.516119 -1.056779
C  3.271894 -1.994036 -0.56587
C  3.853332 -0.848904 -1.39097
C  -2.804324 0.106695 1.57542
C  -4.875722 -0.698223 -0.401067
C  -5.117459 -2.136224 -0.846149
H  0.872723 -0.570798 -0.794005
H  -0.297435 1.310741 1.342844
H  -1.13902 0.527508 -1.497738
H  3.981478 1.336144 -1.55955
H  2.850466 2.966637 -0.12326
H  2.082242 2.560506 1.427775
H  0.300427 3.119269 -0.228827
H  0.958936 1.949014 -1.396519
H  -0.42854 -1.379497 1.882427
H  0.259317 -2.472435 0.670149
H  2.320157 -2.447789 1.336937
H  3.805222 -1.486296 1.472541
H  -1.447244 -1.840451 -1.002634
H  -2.230359 -2.374382 0.510731
H  -3.278457 -0.511554 -1.825907
H  -1.928745 2.820848 -1.414161
H  -2.390757 2.687087 0.297943
H  1.520643 -0.883345 3.063544
H  2.919992 0.217074 2.961546
H  1.264745 0.852627 2.752561
H  -4.516137 1.899178 -0.421622
H  -3.95667 1.757657 -2.103348
H  2.394367 -2.364823 -1.134638
H  3.999534 -2.827138 -0.572972
H  -3.410124 -0.725053 1.979129
H  -1.944063 0.247545 2.251616
H  -3.431292 1.012276 1.629303
H  -5.369509 -2.146242 -1.925273
H  -4.20814 -2.752623 -0.726495
H  -5.954584 -2.578368 -0.283593
