program: Gaussian 09
title: 000235498
version: EM64L-G09RevD.01
frameworkgroup: C1[X(C20H31NO2)]
method: RPBEPBE
basis: SDD
operation: Freq
keyword: #p
keyword: freq=noraman
keyword: PBEPBE/SDD
title: #p freq=noraman PBEPBE/SDD
converged: YES YES NO NO
title: Mulliken charges:
elementType: O O N C C C C C C C C C C C C C C C C C C C C H H H H H H H H H H H H H H H H H H H H H H H H H H H H H H H
charge: -0.443121 -0.276727 -0.223216 0.441712 -0.183846 -0.156758 -0.091413 0.201896 -0.545893 -0.535444 0.276957 -0.546509 -0.515123 -0.513391 -0.888901 0.416902 -0.517127 -0.790806 -0.429843 -0.822172 -0.518000 0.134179 -0.667778 0.211315 0.247563 0.206541 0.215078 0.221745 0.220011 0.219999 0.231248 0.208898 0.213664 0.224563 0.219356 0.216209 0.240452 0.224041 0.237155 0.225186 0.232443 0.241941 0.234866 0.209902 0.227814 0.225360 0.238157 0.226109 0.329443 0.250821 0.248447 0.283771 0.234520 0.227803
chargesum: 0.00000
title: Mulliken charges with hydrogens summed into heavy atoms:
elementType: O O N C C C C C C C C C C C C C C C C C C C C
charge: -0.113677 -0.276727 -0.223216 0.441712 0.027469 0.090805 0.115128 0.201896 -0.109071 -0.095434 0.276957 -0.106363 -0.076896 -0.077825 -0.187253 0.416902 -0.059498 -0.104098 -0.202029 -0.132546 -0.018732 0.134179 0.078317
polarizability: 2.79915908e+02 -1.57204546e+01 2.13013137e+02 8.70557069e-01 -8.94601151e-01 1.68010879e+02
1716.lowfreq: -13.7647 -7.7761 0.0003 0.0004 0.0008 12.6600 32.9682 45.7907 79.4225
frequency: 32.6475 45.6412 79.4017 86.4884 108.1248 116.1217 156.2563 180.4015 194.6787 206.4429 213.8998 221.5939 244.9910 252.6472 255.7568 265.8848 280.3638 285.6319 305.9412 313.8034 319.7946 332.1849 348.8392 358.6645 378.1953 385.2670 393.4256 397.5001 423.2239 444.0838 461.4441 474.6780 498.4957 501.6756 534.2672 553.3879 562.7843 574.2014 593.8333 629.0413 642.1329 683.6887 685.1904 707.4794 788.1060 792.3415 797.8376 825.5229 834.1557 850.3964 857.1932 890.8317 900.6089 908.3276 920.7219 926.9555 940.6848 973.8772 976.9775 984.9450 997.5408 1001.3317 1015.1273 1028.7319 1039.3089 1054.9705 1060.2412 1072.5681 1088.9619 1093.2298 1099.2046 1118.7021 1124.4679 1129.5494 1132.0445 1143.9183 1153.5758 1159.1975 1168.7888 1180.1113 1187.9386 1205.8854 1211.6761 1217.1848 1224.8845 1239.6234 1249.4557 1255.5474 1267.6149 1276.7578 1289.3452 1296.2696 1297.9763 1317.2430 1318.9337 1323.4913 1328.5413 1330.5528 1335.7931 1340.1922 1351.0822 1355.1506 1362.5174 1372.2663 1386.4807 1390.6959 1396.0603 1415.2236 1449.8223 1457.5931 1459.9538 1462.6169 1466.1960 1468.9450 1473.4994 1478.3449 1478.9444 1480.1416 1488.5300 1492.1525 1494.0432 1498.9434 1501.5132 1583.0335 1663.0599 2919.1162 2921.6819 2925.0000 2970.7889 2973.3269 2976.6873 2981.9219 2982.3627 2983.4612 2983.9460 2990.6494 2993.4377 2995.2411 2999.4546 3000.6140 3027.8142 3041.5318 3044.3105 3049.9725 3059.4068 3063.7929 3066.3235 3067.1292 3077.3511 3081.8080 3082.6388 3089.3832 3098.3102 3121.1396 3134.7639 3563.7552
redmass: 4.5306 3.1262 5.0452 3.0534 3.4580 2.7435 2.1511 2.2826 3.8275 2.1362 1.6899 2.2422 1.2746 1.2431 1.4070 1.6024 2.0805 1.9790 3.1322 2.9149 2.7988 2.2576 2.4796 1.9617 2.1928 1.8908 3.1374 2.5529 3.7472 4.0972 3.2182 3.2085 3.8922 2.9820 2.6663 2.8646 3.2889 3.7687 4.0272 4.2367 3.8499 2.6761 2.6277 3.3568 1.5739 2.8003 1.6442 1.8253 2.0050 2.2114 2.2862 2.3812 2.1701 1.7449 1.8355 1.6862 1.7816 1.7443 2.2981 2.4114 2.3756 2.2698 1.8582 1.8243 1.8978 2.1051 2.0536 2.0674 1.8002 2.0358 2.3575 1.4717 1.8661 2.1671 1.6826 1.9158 1.9982 1.8593 1.8454 2.1024 1.7889 2.0756 1.3224 1.5712 2.0295 1.4720 1.5879 2.5147 1.6867 1.4050 1.3988 1.2836 1.6415 1.6150 1.5331 1.5334 1.7529 1.4538 1.4602 1.5771 1.4928 1.6322 1.6368 1.9730 1.2060 1.2749 1.2287 1.2345 1.0773 1.0640 1.0912 1.0613 1.0808 1.0800 1.0732 1.0688 1.0826 1.0757 1.0618 1.0624 1.0555 1.0566 1.0619 9.0255 7.4497 1.0812 1.0685 1.0788 1.0773 1.0621 1.0406 1.0493 1.0441 1.0627 1.0431 1.0602 1.0435 1.0785 1.0651 1.0663 1.1007 1.1008 1.1007 1.0978 1.0984 1.0982 1.1017 1.1000 1.0991 1.0966 1.0984 1.0993 1.0995 1.0990 1.0892 1.0653
irintensity: 1.3992 0.0453 2.0455 3.5686 0.7777 0.4685 0.0615 2.1744 0.5577 1.6840 1.1145 2.0949 0.6483 0.3678 0.7141 10.4332 2.0391 3.3978 5.4088 1.1097 1.0855 7.3051 14.7324 30.8881 5.7904 40.6234 6.0241 39.6564 2.0401 2.2272 1.1479 1.2779 8.9127 1.0789 2.7537 3.2724 1.0856 5.2535 3.3923 4.8603 1.6763 0.0676 8.7288 0.6202 4.7489 0.4735 17.3830 6.9512 7.0865 6.3586 4.7836 6.7709 40.5825 0.2376 2.9917 0.3303 6.1271 20.8681 1.2752 1.3824 0.7418 4.8739 3.2043 4.9439 14.4804 12.8430 80.4960 15.1718 0.3694 18.6818 7.3220 2.9147 15.6902 29.4383 8.9852 10.5523 10.3188 6.2262 19.0559 6.5302 9.9475 13.2567 16.5861 9.4428 4.1741 27.5322 8.2554 28.2296 9.7905 2.7783 4.9750 2.3146 13.5246 74.4998 20.0580 3.7543 33.0580 5.3612 7.9247 6.8502 7.4406 33.8871 3.2156 29.6642 43.5307 14.4559 20.8694 65.2205 11.0228 3.3006 4.7706 5.4510 10.5732 11.6181 5.8759 0.9371 22.8815 11.3694 7.4817 4.7116 4.7194 21.9208 8.5110 426.5415 13.0249 2.9826 37.1223 28.1988 9.0508 35.6565 21.9470 36.4733 35.0966 22.7678 8.0257 44.3692 9.0100 46.6461 15.9122 61.4758 16.0242 4.8868 57.3789 33.8566 45.0137 20.7565 37.5640 30.2489 29.0925 43.8754 15.7667 40.0365 25.6697 2.9897 28.6432 5.9387
temp: 298.150 k
press: 1.00000 atm
elementType: 8 8 7 6 6 6 6 6 6 6 6 6 6 6 6 6 6 6 6 6 6 6 6 1 1 1 1 1 1 1 1 1 1 1 1 1 1 1 1 1 1 1 1 1 1 1 1 1 1 1 1 1 1 1
symmnumber: 1
zpe: 1243937.4 jmol-1
zpe.correction: 0.473791 hartree
zpe.thermalcorrener: 0.496009 hartree
zpe.thermalcorrenthalpy: 0.496954 hartree
zpe.thermalcorrgfe: 0.425369 hartree
zpe.sumelectzpe: -984.142512 hartree
zpe.sumelectthermal: -984.120294 hartree
zpe.sumelectthermalent: -984.119350 hartree
zpe.sumelectthermalfe: -984.190934 hartree
dipole: -2.7575 1.5404 0.6949
dipole: 3.2341
quadrupole: -187.0333 -134.4670 -136.4104
quadrupole: -2.2696 -3.7872 -0.4454
quadrupole: -34.3964 18.1699 16.2265 -2.2696 -3.7872 -0.4454
hfenergy: -984.6163031 hartree
pointgroup: C01 [X(C20H31N1O2)]
dipole: -1.0874812 -0.6049528 -0.2653982 debye
polarizability: 279.9854063|15.5410401|212.9216801|-1.4115078|-1.227318|168.0328374 unknown
InChI: InChI=1S/C20H31NO2/c1-18-10-9-17(22)21(4)16(18)6-5-13-14(18)7-11-19(2)15(13)8-12-20(19,3)23/h6,13-15,23H,5,7-12H2,1-4H3
charge 0 multiplicity 1
54 atoms
O  -5.364284 0.878268 -0.36497
O  5.846228 0.391386 0.088369
N  3.790066 -0.716589 0.019645
C  -2.841002 0.474273 -0.215398
C  -2.040262 -0.799682 0.183879
C  -0.560557 -0.776772 -0.250558
C  0.139599 0.497151 0.319674
C  -4.293352 0.086269 0.283254
C  -2.167141 1.691094 0.458082
C  -2.937455 -1.975453 -0.28321
C  1.636711 0.60694 -0.15473
C  -0.6746 1.797086 0.043111
C  -4.395218 -1.447454 -0.076839
C  0.174742 -2.04438 0.238812
C  -2.896641 0.684977 -1.75511
C  2.350443 -0.740612 0.050126
C  2.381595 1.655811 0.724517
C  -4.547318 0.339575 1.779017
C  1.68048 -1.920261 0.213501
C  1.738775 1.005301 -1.661144
C  3.861745 1.775992 0.330104
C  4.578138 0.443727 0.140339
C  4.516837 -1.998194 -0.101366
H  -2.02733 -0.822088 1.297641
H  -0.506016 -0.756092 -1.358456
H  0.169973 0.36077 1.425944
H  -2.223445 1.5843 1.55944
H  -2.696742 2.628492 0.197086
H  -2.746912 -2.900843 0.288344
H  -2.744751 -2.208332 -1.348343
H  -0.614133 2.058667 -1.029641
H  -0.219436 2.643413 0.592227
H  -5.007525 -1.581017 -0.98917
H  -4.916489 -1.991708 0.73032
H  -0.137778 -2.917239 -0.369766
H  -0.152804 -2.277615 1.277517
H  -1.892134 0.752939 -2.203538
H  -3.419158 -0.140868 -2.274683
H  -3.42194 1.629451 -1.988197
H  2.297556 1.352926 1.787134
H  1.898613 2.64508 0.629497
H  -4.52702 1.419878 2.001025
H  -5.549647 -0.039833 2.042902
H  -3.803638 -0.171374 2.415232
H  2.23907 -2.850194 0.368865
H  1.495831 2.072911 -1.811991
H  2.756032 0.833091 -2.053262
H  1.04801 0.402565 -2.276399
H  -5.37387 0.667363 -1.332571
H  4.439979 2.338307 1.084493
H  3.973223 2.33958 -0.616262
H  5.578982 -1.762594 -0.26352
H  4.119338 -2.57801 -0.952456
H  4.421132 -2.599978 0.821583
