program: Gaussian 09
title: 000235487
version: EM64L-G09RevD.01
frameworkgroup: C1[X(C17H18N4O4S)]
method: RPBEPBE
basis: SDD
operation: Freq
keyword: #p
keyword: freq=noraman
keyword: PBEPBE/SDD
title: #p freq=noraman PBEPBE/SDD
converged: YES YES NO NO
title: Mulliken charges:
elementType: S O O O O N N N N C C C C C C C C C C C C C C C C C H H H H H H H H H H H H H H H H H H
charge: 0.266594 -0.236469 -0.444036 -0.465817 -0.445718 -0.185987 -0.050061 -0.016572 0.039432 -0.203641 -0.138917 -0.134379 -0.038059 -0.359514 0.203553 -0.203831 0.001897 -0.333999 -0.373205 -0.851981 0.532353 -0.395413 -0.372761 -0.228143 -0.223579 -0.241051 0.303060 0.245999 0.255317 0.259467 0.190125 0.238057 0.357520 0.367698 0.270883 0.373148 0.269451 0.271198 0.316446 0.253363 0.233364 0.239897 0.225613 0.228698
chargesum: 0.00000
title: Mulliken charges with hydrogens summed into heavy atoms:
elementType: S O O O O N N N N C C C C C C C C C C C C C C C C C
charge: 0.266594 -0.236469 -0.086516 -0.098119 -0.072570 -0.185987 -0.050061 -0.016572 0.039432 0.099419 0.116400 0.111620 0.221408 0.068669 0.203553 0.067052 0.001897 -0.064548 -0.373205 -0.264337 0.532353 -0.142050 -0.139397 0.011753 0.002034 -0.012353
polarizability: 3.46421701e+02 2.38306053e+00 2.32410448e+02 -1.09546707e+01 9.39958720e+00 1.61661383e+02
1716.lowfreq: -7.8277 -5.8187 -3.7043 -0.0011 -0.0009 0.0010 14.1873 21.0116 34.2974
frequency: 14.0417 20.9562 34.1604 42.7370 55.2806 60.7516 79.9501 88.9167 97.1428 113.1159 118.9568 129.4328 176.1467 202.4009 223.6353 230.2481 253.4432 285.2181 311.0846 312.5828 322.0735 329.3987 352.9999 366.4602 381.7921 391.9320 403.5571 412.7489 431.3931 471.6720 491.4388 494.8663 517.6845 529.4638 551.7946 568.6179 575.1991 616.2107 634.7794 637.2433 653.9338 680.0674 701.4362 705.9559 771.3792 776.9066 786.4564 791.8001 807.7329 829.4899 857.1745 867.7969 881.7920 891.2680 900.0650 930.7129 940.2729 953.1023 971.0874 981.9510 990.0967 993.5304 1000.7218 1014.1881 1016.8947 1024.4325 1055.7636 1063.0988 1066.0373 1078.7567 1133.0426 1133.5452 1140.5863 1148.8266 1161.9127 1172.4909 1173.8069 1189.4284 1200.7504 1218.9044 1230.3581 1232.3887 1249.2548 1259.2442 1266.4557 1274.0225 1283.6140 1293.4904 1309.2101 1310.3254 1326.8688 1330.4781 1350.3936 1363.9671 1382.9540 1384.0283 1391.2240 1404.2807 1414.6640 1440.0993 1451.0879 1470.3795 1481.7302 1483.7702 1517.1946 1565.0826 1592.8898 1612.3336 2968.6459 2981.7964 3013.9718 3032.8991 3038.4975 3055.9415 3092.6476 3115.9375 3122.2293 3128.2028 3138.1364 3149.3669 3157.3065 3164.9731 3225.5107 3465.5205 3574.0632 3577.3620
redmass: 5.8902 6.1741 4.8235 6.2213 5.3147 5.8255 5.9636 6.3852 6.6574 7.6036 5.0115 6.2329 4.3879 4.5960 5.6354 5.8302 6.0489 5.1335 4.7571 5.8812 1.1314 2.2152 5.7770 5.9120 1.2303 11.8519 2.7256 3.5789 4.8908 3.8710 3.4083 3.5485 1.3456 3.3834 6.0161 6.6402 7.4635 6.2411 4.8137 4.7345 6.0714 11.2827 6.1770 1.7973 4.1673 3.0570 6.5333 4.6895 3.8354 1.6532 1.2550 5.4873 1.7983 1.7947 5.5833 1.4443 1.4903 6.2567 5.1207 1.4675 5.6990 4.5293 1.3250 3.1024 5.2171 2.1950 3.8094 3.7188 1.8306 1.5774 2.2032 1.4540 1.2558 2.0884 3.8843 1.0604 2.1365 1.1197 1.1900 1.7048 1.4568 1.6569 1.3839 2.5583 2.3721 1.2141 1.4237 1.3885 5.3535 1.2630 1.2755 2.0269 1.6108 1.3756 2.0891 3.4043 1.2923 4.5496 1.5919 2.1954 3.6543 1.1135 1.0899 2.3203 10.0745 7.6083 6.0169 6.1368 1.0694 1.0838 1.0839 1.0868 1.0590 1.0866 1.0963 1.0875 1.1052 1.0871 1.0915 1.0963 1.0939 1.1015 1.0985 1.0669 1.0663 1.0667
irintensity: 0.0452 0.8424 0.1221 1.2136 0.8558 0.5295 1.6118 1.1239 0.1851 1.2127 3.5596 1.7752 1.7015 4.5844 2.8887 5.0560 3.3441 2.2486 1.6325 5.8534 103.1543 1.5535 3.5560 5.1719 54.7237 2.1699 7.1566 1.7191 0.8546 10.3890 38.4197 76.9511 203.2850 47.5319 10.0368 15.6616 14.5153 1.7775 20.1455 27.9984 4.5040 0.7230 4.8758 51.8385 43.6632 6.7626 38.3403 22.9594 15.2240 14.6021 2.9061 34.6553 18.5793 5.6344 28.6239 2.0962 13.0698 100.9149 67.5440 3.1104 2.6417 28.1887 0.0878 44.8047 45.1432 5.9596 88.1171 15.4454 76.0514 13.5264 22.4814 57.1391 13.0600 142.1351 3.3022 1.1651 58.6577 0.2499 20.4837 3.5890 0.6169 32.5184 34.1415 9.5335 27.1538 5.9946 6.9194 22.9398 109.8748 28.4856 0.4112 163.2548 77.3343 17.4815 5.8121 5.4561 37.8858 1.5818 11.3430 11.2470 68.5659 5.9455 4.2266 12.5012 84.6106 154.2144 0.7487 1.3588 59.0419 20.7751 34.5859 5.8343 11.2861 18.5545 20.5378 5.6493 5.9200 2.0742 16.3601 29.5718 11.9120 24.2384 0.3639 33.4254 16.2456 16.9527
temp: 298.150 k
press: 1.00000 atm
elementType: 16 8 8 8 8 7 7 7 7 6 6 6 6 6 6 6 6 6 6 6 6 6 6 6 6 6 1 1 1 1 1 1 1 1 1 1 1 1 1 1 1 1 1 1
symmnumber: 1
zpe: 877242.7 jmol-1
zpe.correction: 0.334124 hartree
zpe.thermalcorrener: 0.357744 hartree
zpe.thermalcorrenthalpy: 0.358689 hartree
zpe.thermalcorrgfe: 0.278431 hartree
zpe.sumelectzpe: -1574.632261 hartree
zpe.sumelectthermal: -1574.608641 hartree
zpe.sumelectthermalent: -1574.607696 hartree
zpe.sumelectthermalfe: -1574.687954 hartree
dipole: 1.8905 -3.8367 4.7889
dipole: 6.4209
quadrupole: -151.2833 -171.4360 -153.3059
quadrupole: -7.6893 3.1184 -1.9545
quadrupole: 7.3917 -12.7610 5.3692 -7.6893 3.1184 -1.9545
hfenergy: -1574.966385 hartree
pointgroup: C01 [X(C17H18N4O4S1)]
dipole: -1.0973929 -1.8714124 -1.2942411 debye
polarizability: 339.14416|-21.1244276|224.9017902|-30.7425835|-23.1199544|176.4475821 unknown
InChI: InChI=1S/C17H18N4O4S/c22-7-12-13(23)14(24)16(25-12)21-9-19-11-6-18-17(20-15(11)21)26-8-10-4-2-1-3-5-10/h1-6,9,12-14,16,22-24H,7-8H2
charge 0 multiplicity 1
44 atoms
S  1.466047 2.315933 -1.233408
O  -2.146436 -1.454315 1.755013
O  -2.908132 -2.716633 -1.483838
O  0.227389 -2.839966 -0.652133
O  1.347599 -2.816063 2.086766
N  -3.110687 0.278831 0.351926
N  -4.162903 2.314588 0.638041
N  -0.891955 1.105594 -0.41851
N  -0.791084 3.555566 -0.524224
C  -2.095959 -1.817122 -0.666569
C  -1.033863 -2.656544 0.065479
C  -2.896319 -1.164682 0.512608
C  -0.76692 -1.844908 1.344549
C  -0.062353 -2.624226 2.456412
C  -2.171192 1.260888 0.0024
C  -4.275546 0.985569 0.739213
C  -2.841785 2.514436 0.17967
C  -2.078371 3.67071 -0.101521
C  -0.259043 2.29246 -0.66988
C  1.840015 0.446696 -1.531785
C  3.199903 0.069639 -0.997626
C  3.331808 -0.544467 0.275041
C  4.368338 0.305267 -1.769151
C  4.604165 -0.913038 0.765297
C  5.6419 -0.057356 -1.277718
C  5.763392 -0.668492 -0.007593
H  -1.596588 -1.042441 -1.276995
H  -3.887883 -1.638558 0.616522
H  -1.489645 -3.636162 0.323409
H  -0.178681 -0.940311 1.09439
H  -0.573092 -3.593665 2.635537
H  -0.055167 -2.046621 3.39427
H  -3.40315 -2.201627 -2.168891
H  0.076502 -3.408324 -1.44861
H  -5.164144 0.459707 1.085152
H  1.38782 -3.11155 1.13569
H  -2.480846 4.682369 0.010048
H  1.769578 0.314899 -2.623442
H  1.021241 -0.097041 -1.038383
H  2.444093 -0.750534 0.88389
H  4.278747 0.775246 -2.756812
H  4.684286 -1.395117 1.745792
H  6.535375 0.132308 -1.883297
H  6.750347 -0.953743 0.373868
