program: Gaussian 09
title: 000235484
version: EM64L-G09RevD.01
frameworkgroup: C1[X(C11H15N5O4S)]
method: RPBEPBE
basis: SDD
operation: Freq
keyword: #p
keyword: freq=noraman
keyword: PBEPBE/SDD
title: #p freq=noraman PBEPBE/SDD
converged: YES YES NO NO
title: Mulliken charges:
elementType: S O O O O N N N N N C C C C C C C C C C C H H H H H H H H H H H H H H H
charge: 0.275636 -0.279883 -0.452124 -0.460087 -0.436332 -0.185744 -0.075641 -0.152067 -0.005820 -0.610417 -0.189236 -0.073505 -0.170360 -0.103148 -0.342176 0.292339 -0.225839 -0.139053 0.169554 -0.354672 -0.856847 0.276128 0.243850 0.239298 0.271614 0.224135 0.216320 0.352965 0.404087 0.274165 0.351941 0.349958 0.339072 0.248494 0.269856 0.313540
chargesum: 0.00000
title: Mulliken charges with hydrogens summed into heavy atoms:
elementType: S O O O O N N N N N C C C C C C C C C C C
charge: 0.275636 -0.279883 -0.099159 -0.056000 -0.084390 -0.185744 -0.075641 -0.152067 -0.005820 0.078612 0.086892 0.170345 0.068938 0.168466 0.098278 0.292339 0.048326 -0.139053 0.169554 -0.354672 -0.024957
polarizability: 2.32936929e+02 5.30401051e+00 2.26021919e+02 7.29874091e+00 3.99692613e+00 1.09714677e+02
1716.lowfreq: -4.1166 0.0011 0.0020 0.0021 6.2136 9.3027 26.1168 39.8622 63.4078
frequency: 25.7992 39.8431 63.4038 75.4948 96.3284 100.4893 112.6914 131.8866 150.6856 162.2205 198.9085 205.9853 224.3777 234.7967 255.8221 268.4760 294.0979 314.3900 317.1929 327.3289 353.6986 374.9635 411.6676 422.8918 461.5209 467.9963 530.2278 537.9751 545.4478 555.3469 567.5527 620.2693 633.5759 662.2874 663.0057 665.1762 693.9402 741.3537 762.1639 784.3213 793.6160 813.8157 817.9749 881.2805 930.5560 932.3937 940.1636 957.8992 975.0309 984.2028 997.6704 1006.6413 1008.2853 1019.9612 1029.6713 1042.9629 1069.8593 1087.3628 1149.7259 1169.5619 1178.0542 1187.1034 1200.9969 1229.2615 1231.6924 1259.2073 1264.7372 1275.9646 1295.9140 1302.4695 1316.2320 1329.4371 1335.7693 1349.4952 1357.1733 1380.8473 1387.8717 1404.5085 1438.6438 1444.8115 1460.2901 1465.7944 1468.1844 1543.0301 1559.5648 1579.8629 1634.5085 2673.1655 2975.9610 3019.5713 3024.9558 3031.8308 3036.4462 3060.7727 3076.3012 3138.6723 3156.7150 3232.3504 3532.3446 3536.7783 3578.8456 3691.0124
redmass: 6.7082 4.7217 4.5597 5.8973 3.6499 5.1406 7.2392 4.1000 2.7972 3.0448 3.1517 2.7721 4.4042 5.1768 4.5677 4.0347 4.9676 1.4751 5.5956 3.2651 4.9163 6.7813 4.5140 6.1784 1.5540 2.6645 5.3622 1.2574 4.8981 1.0798 5.6595 5.1715 4.3009 7.2602 7.1736 10.8153 6.2721 4.2815 9.2362 3.9904 4.1565 2.1525 4.1919 7.2990 3.1441 2.1346 1.7682 2.5209 1.2267 3.3343 2.6762 1.6835 3.0339 2.3273 4.4573 2.7553 2.7157 2.8786 1.6409 2.1597 1.2801 2.3587 1.5338 1.4172 2.2198 1.5677 2.4217 1.2738 4.5589 1.3800 1.3686 4.7344 1.5361 1.3281 1.1599 1.2782 2.0146 3.8749 2.8974 1.0707 1.4306 2.2543 1.0907 1.9579 1.8283 1.9787 2.6211 1.0831 1.0648 1.0288 1.0869 1.0852 1.0877 1.0895 1.0965 1.1033 1.1061 1.0987 1.0653 1.0445 1.0664 1.1057
irintensity: 1.0013 0.6023 2.8366 1.0037 9.2101 0.4578 0.1238 0.9899 0.4179 5.8478 0.3107 4.6091 6.0006 2.7158 10.8335 3.1181 1.2457 139.7356 3.0216 8.3097 11.5899 13.5731 2.0434 1.7697 111.6715 53.2754 28.0791 241.7051 4.4434 7.0004 10.4392 0.4784 46.7768 0.8439 1.1126 9.0374 17.0944 42.0534 18.0079 11.5021 9.3950 34.5374 101.4979 12.0402 32.1817 17.4873 89.7393 25.5316 4.5726 151.9435 20.8518 51.1139 42.1056 66.7749 26.0549 35.1883 25.4188 10.5550 48.1238 49.3967 17.0169 22.7581 28.7035 19.4540 106.7440 55.1372 125.3377 18.2306 39.8293 6.4985 10.2160 70.8354 78.7103 8.4098 5.9835 30.7785 62.0035 0.4470 63.7689 18.2137 46.0541 50.6766 2.9725 85.3404 163.4402 76.3208 700.8144 1476.3851 29.3130 14.9192 29.6015 9.6144 20.7680 7.4329 29.9554 11.4104 5.3131 0.5975 7.4546 151.3400 14.3618 54.0634
temp: 298.150 k
press: 1.00000 atm
elementType: 16 8 8 8 8 7 7 7 7 7 6 6 6 6 6 6 6 6 6 6 6 1 1 1 1 1 1 1 1 1 1 1 1 1 1 1
symmnumber: 1
zpe: 713640.6 jmol-1
zpe.correction: 0.271811 hartree
zpe.thermalcorrener: 0.291714 hartree
zpe.thermalcorrenthalpy: 0.292658 hartree
zpe.thermalcorrgfe: 0.223169 hartree
zpe.sumelectzpe: -1399.296313 hartree
zpe.sumelectthermal: -1399.276410 hartree
zpe.sumelectthermalent: -1399.275466 hartree
zpe.sumelectthermalfe: -1399.344956 hartree
dipole: -0.5911 -2.4705 2.4477
dipole: 3.5276
quadrupole: -128.3381 -126.0700 -133.0778
quadrupole: 7.8617 16.1945 -0.5087
quadrupole: 0.8239 3.0920 -3.9158 7.8617 16.1945 -0.5087
hfenergy: -1399.5681242 hartree
pointgroup: C01 [X(C11H15N5O4S1)]
dipole: -0.5053229 1.0531206 -0.7495244 debye
polarizability: 235.6674767|-0.8541178|216.7884814|-6.179613|26.9891457|116.2175677 unknown
InChI: InChI=1S/C11H15N5O4S/c1-21-11-14-8(12)5-9(15-11)16(3-13-5)10-7(19)6(18)4(2-17)20-10/h3-4,6-7,10,17-19H,2,12H2,1H3
charge 0 multiplicity 1
36 atoms
S  -1.653179 -3.593813 -0.904537
O  1.719805 0.563862 1.215652
O  2.739207 2.377602 -1.253368
O  1.60865 -1.179629 -1.48811
O  4.28346 0.255771 2.408432
N  -0.34369 1.378643 0.310537
N  -2.511248 2.041315 0.701629
N  -0.790969 -1.007401 -0.333033
N  -3.183529 -1.533425 -0.260117
N  -4.83295 0.061039 0.281887
C  1.780121 1.271063 -1.111218
C  1.119215 1.5133 0.273312
C  2.464953 -0.127396 -0.993032
C  2.781486 -0.245557 0.517284
C  4.149642 0.302174 0.949995
C  -1.146345 0.255436 0.063556
C  -1.224094 2.412597 0.700829
C  -2.474496 0.693533 0.304451
C  -3.517671 -0.260199 0.107504
C  -1.869957 -1.848897 -0.451259
C  0.203051 -3.866303 -0.754809
H  1.047024 1.26313 -1.9397
H  1.347284 2.547687 0.588722
H  3.384907 -0.166951 -1.604301
H  2.648851 -1.280166 0.87607
H  4.28277 1.334172 0.564702
H  4.957407 -0.340953 0.559161
H  3.193292 2.305699 -2.130049
H  0.695391 -1.178585 -0.992395
H  -0.854523 3.40113 0.965728
H  3.468354 0.67912 2.786155
H  -5.088204 1.004616 0.567082
H  -5.542785 -0.654768 0.13931
H  0.324589 -4.956937 -0.849622
H  0.54908 -3.532548 0.23449
H  0.756001 -3.344164 -1.54644
