program: Gaussian 09
title: 000235481
version: EM64L-G09RevD.01
frameworkgroup: C1[X(C10H12ClN5O4)]
method: RPBEPBE
basis: SDD
operation: Freq
keyword: #p
keyword: freq=noraman
keyword: PBEPBE/SDD
title: #p freq=noraman PBEPBE/SDD
converged: YES YES NO NO
title: Mulliken charges:
elementType: Cl O O O O N N N N N C C C C C C C C C C H H H H H H H H H H H H
charge: 0.022665 -0.264493 -0.453712 -0.474735 -0.448156 -0.173087 -0.078074 -0.139329 0.036463 -0.601727 -0.179449 -0.050746 -0.229760 -0.016286 -0.370338 0.277199 -0.200883 -0.123667 0.190820 -0.296358 0.264127 0.241626 0.268200 0.236934 0.206716 0.224859 0.353165 0.417931 0.278388 0.380671 0.355224 0.345810
chargesum: 0.00000
title: Mulliken charges with hydrogens summed into heavy atoms:
elementType: Cl O O O O N N N N N C C C C C C C C C C
charge: 0.022665 -0.264493 -0.100547 -0.056804 -0.067485 -0.173087 -0.078074 -0.139329 0.036463 0.099307 0.084678 0.190881 0.038441 0.220648 0.061237 0.277199 0.077505 -0.123667 0.190820 -0.296358
polarizability: 2.08264477e+02 -2.10677974e+00 1.89223537e+02 8.24801096e+00 -8.74010732e+00 9.85819529e+01
1716.lowfreq: -6.7657 -4.1691 0.0009 0.0012 0.0014 6.9895 31.8848 38.6352 70.6236
frequency: 31.6952 38.5643 70.6171 96.2046 109.3668 115.7057 137.8648 171.6756 200.2684 227.8021 234.4308 246.0030 266.0335 294.6572 303.9433 322.2868 332.0255 358.5902 372.3792 412.4618 443.6745 460.8920 524.0151 557.7143 563.2821 565.9761 580.1631 623.3546 636.5639 660.4107 666.4225 692.5964 702.6512 745.0823 766.8310 789.7219 800.2661 810.9282 829.8938 882.5645 900.4421 917.0777 940.9012 960.3314 991.2250 996.8231 1004.4312 1012.3037 1031.3891 1033.3746 1049.4765 1112.6664 1153.2995 1173.2116 1184.7915 1193.1078 1200.7770 1229.4701 1251.2607 1265.4067 1272.8753 1280.2867 1300.7117 1308.5820 1329.7800 1340.3886 1351.0875 1359.7573 1388.3563 1404.6298 1410.1493 1436.2306 1468.1274 1470.3043 1506.8344 1552.6089 1583.5695 1640.5800 2774.7102 2982.7536 3009.5343 3014.1818 3023.7832 3063.1333 3093.7175 3236.6662 3381.9356 3533.5232 3576.7588 3686.0696
redmass: 8.4889 5.8549 6.7487 9.3490 4.1941 4.9209 5.9913 6.8384 6.2604 8.4210 4.3036 7.0814 5.4304 5.9183 5.2251 5.6782 1.2269 5.4360 16.1213 4.8965 6.2669 6.2192 8.9823 1.2115 1.2740 3.6551 3.9934 5.1640 4.5947 8.4874 7.4469 3.8673 2.3082 1.5354 8.9032 5.8785 4.6891 5.9335 1.6241 7.4836 3.5959 1.4511 2.8772 2.0038 4.9369 4.9621 2.8078 3.1767 3.6846 3.5912 2.6566 2.5992 1.6964 2.0233 2.1061 1.2536 1.4755 2.4830 1.2491 2.7102 1.3300 1.3200 3.5315 1.4601 1.4481 1.5766 1.3480 6.4149 1.7273 1.2670 4.9183 3.5377 4.5975 1.0794 1.1700 6.1921 1.9046 2.7468 1.0780 1.0671 1.0847 1.0871 1.0855 1.0876 1.0983 1.0990 1.0651 1.0448 1.0663 1.1057
irintensity: 0.3788 0.2214 3.3565 0.9261 3.3609 2.7875 6.2877 9.3767 3.0947 3.3398 5.1217 4.8753 3.5625 5.4607 2.5506 17.9304 156.5892 0.6340 2.5609 2.2941 1.2059 6.1010 15.8764 78.7871 149.9358 20.4498 3.8238 3.8121 62.3013 11.8462 3.1184 6.7168 72.4123 66.7571 54.9102 10.3213 21.9760 67.1924 15.0100 16.2745 24.7214 65.3709 118.9310 46.7353 86.6579 66.0003 102.5665 38.8885 41.6053 8.9597 39.0604 9.8204 76.3745 42.6012 20.7328 28.8976 20.1645 66.3990 9.6561 116.3353 21.2898 7.0337 47.5168 35.0134 3.2073 18.3362 33.7214 109.1559 37.3106 114.7921 13.1753 33.5659 55.4918 3.8689 33.6912 152.7835 59.1418 719.5507 1573.4714 41.4373 31.3038 44.7675 18.9612 15.6851 41.5620 0.7035 73.5140 168.3925 14.1176 59.7276
temp: 298.150 k
press: 1.00000 atm
elementType: 17 8 8 8 8 7 7 7 7 7 6 6 6 6 6 6 6 6 6 6 1 1 1 1 1 1 1 1 1 1 1 1
symmnumber: 1
zpe: 616250.1 jmol-1
zpe.correction: 0.234717 hartree
zpe.thermalcorrener: 0.252155 hartree
zpe.thermalcorrenthalpy: 0.253099 hartree
zpe.thermalcorrgfe: 0.189026 hartree
zpe.sumelectzpe: -1421.477858 hartree
zpe.sumelectthermal: -1421.460421 hartree
zpe.sumelectthermalent: -1421.459476 hartree
zpe.sumelectthermalfe: -1421.523550 hartree
dipole: 3.4591 -5.0311 -1.7445
dipole: 6.3498
quadrupole: -107.6626 -134.6190 -121.8005
quadrupole: 5.7354 10.7235 0.7781
quadrupole: 13.6981 -13.2583 -0.4398 5.7354 10.7235 0.7781
hfenergy: -1421.7125754 hartree
pointgroup: C01 [X(C10H12Cl1N5O4)]
dipole: -1.2783772 2.1377422 -0.192013 debye
polarizability: 207.4650833|-7.5728132|171.8085303|11.3053312|36.22237|116.7963537 unknown
InChI: InChI=1S/C10H12ClN5O4/c11-10-14-7(12)4-8(15-10)16(2-13-4)9-6(19)5(18)3(1-17)20-9/h2-3,5-6,9,17-19H,1,12H2
charge 0 multiplicity 1
32 atoms
Cl -1.106321 -2.947865 -2.228566
O  1.607726 0.274289 1.552145
O  3.248294 2.27895 -0.434971
O  2.109607 -1.192006 -1.259123
O  3.448506 -2.801506 0.523881
N  -0.122771 1.413857 0.378825
N  -2.310916 2.1050 0.550206
N  -0.495802 -0.710776 -0.881671
N  -2.857686 -1.108257 -1.348944
N  -4.567033 0.372063 -0.680532
C  2.234749 1.227495 -0.600052
C  1.322875 1.391758 0.652347
C  2.839554 -0.202102 -0.480699
C  2.811279 -0.465658 1.049558
C  2.649959 -1.958896 1.414153
C  -0.893013 0.440643 -0.258194
C  -1.033278 2.381179 0.853514
C  -2.236582 0.886279 -0.147005
C  -3.242956 0.05741 -0.724229
C  -1.547355 -1.406332 -1.388822
H  1.684349 1.343521 -1.553646
H  1.570267 2.35584 1.135528
H  3.873615 -0.226959 -0.863133
H  3.708808 -0.016443 1.516713
H  1.570583 -2.210231 1.366364
H  3.01786 -2.158709 2.432586
H  3.907588 2.218348 -1.171159
H  1.091294 -1.096191 -1.11108
H  -0.695384 3.254048 1.408291
H  3.051914 -2.672139 -0.387106
H  -4.868279 1.227395 -0.216481
H  -5.24445 -0.259006 -1.105197
