program: Gaussian 09
title: 000235475
version: EM64L-G09RevD.01
frameworkgroup: C1[X(C14H18ClNO4)]
method: RPBEPBE
basis: SDD
operation: Freq
keyword: #p
keyword: freq=noraman
keyword: PBEPBE/SDD
title: #p freq=noraman PBEPBE/SDD
converged: YES YES NO NO
title: Mulliken charges:
elementType: Cl O O O O N C C C C C C C C C C C C C C H H H H H H H H H H H H H H H H H H
charge: -0.059196 -0.295173 -0.279689 -0.245676 -0.256138 -0.182170 0.512048 -0.385602 -0.394699 -0.520040 -0.497022 0.269976 0.282320 -0.583989 -0.661766 -0.500803 0.146305 0.152258 -0.500906 -0.500316 0.253795 0.248964 0.223660 0.229193 0.276244 0.280343 0.264010 0.294370 0.219201 0.220435 0.244801 0.308012 0.229867 0.243938 0.243553 0.242206 0.235391 0.242294
chargesum: 0.00000
title: Mulliken charges with hydrogens summed into heavy atoms:
elementType: Cl O O O O N C C C C C C C C C C C C C C
charge: -0.059196 -0.295173 -0.279689 -0.245676 -0.256138 -0.182170 0.512048 0.117157 0.058154 -0.243796 -0.216679 0.269976 0.282320 -0.025608 0.022672 -0.192791 0.146305 0.152258 0.216451 0.219575
polarizability: 2.54749000e+02 -2.61911564e+00 2.34789171e+02 -7.94177143e+00 1.11853021e+00 1.03687121e+02
1716.lowfreq: -8.6921 -1.4812 0.0021 0.0024 0.0030 4.4936 22.8485 33.4094 41.3170
frequency: 22.7279 33.4031 41.3104 41.4631 59.6844 77.5422 87.3518 91.3586 98.8032 108.0213 111.2383 127.4076 132.9693 181.8347 199.5982 212.8347 222.8444 224.7001 235.7474 248.1097 269.5226 310.1265 329.6697 330.1683 371.0577 417.0101 464.5870 481.8761 500.6411 547.5097 560.6765 580.6478 674.1781 682.5533 686.6957 723.6540 726.8627 744.6910 779.8820 794.3430 809.7334 826.9010 898.2683 901.6248 915.9896 939.7243 953.7821 969.8391 976.5943 1003.6849 1029.1207 1042.4937 1077.0585 1095.8103 1101.8118 1111.1770 1113.5978 1114.5881 1147.7219 1151.1235 1170.2143 1199.5617 1210.9147 1244.6669 1254.3207 1285.2042 1295.6627 1296.9831 1345.2796 1356.7926 1391.2600 1395.1418 1397.5648 1422.8077 1426.8871 1451.3616 1451.7543 1452.6224 1459.0334 1463.1978 1464.5352 1468.6391 1470.4277 1478.8966 1488.1969 1509.2025 1589.7917 1605.9184 1622.9186 1633.5424 2985.9406 2996.4319 3003.6112 3003.9518 3013.5620 3045.0475 3060.7041 3070.1944 3081.7700 3095.0970 3105.0289 3105.0903 3145.5540 3146.4179 3149.8810 3162.3494 3190.7606 3195.8105
redmass: 6.1511 9.8011 5.1050 5.7528 4.5345 3.2802 3.2952 2.2433 1.3161 1.4585 2.3984 3.2278 3.1388 3.3318 2.4080 2.3866 2.9309 4.5707 3.0538 3.7330 5.0322 4.3293 4.1228 4.7645 3.6584 4.9232 4.9411 5.4295 4.2023 3.5201 5.9375 4.2484 3.5975 4.2168 6.0280 5.6543 3.4172 7.1470 1.1920 1.1944 3.8490 5.6922 1.7949 3.4163 1.4469 1.5508 3.7195 7.2433 5.0979 1.7642 2.9794 3.0603 2.0100 3.0277 1.9908 1.4954 1.2644 1.2639 1.4871 1.5302 1.6699 2.4590 2.5364 1.6043 1.3387 1.1918 1.3209 1.7646 1.2787 1.3317 1.2749 2.3356 4.5363 1.2151 1.2707 1.0600 2.7130 1.0501 1.2001 1.0569 1.0647 1.1011 2.9158 1.0750 1.0945 1.1530 6.3169 7.1488 9.8388 8.8109 1.0358 1.0608 1.0295 1.0297 1.0606 1.1026 1.0572 1.1035 1.0999 1.1008 1.1044 1.1044 1.1121 1.1048 1.1046 1.0906 1.0905 1.0928
irintensity: 0.2711 0.5705 4.4621 0.2807 0.0306 0.3458 1.4896 2.0134 0.1547 0.0609 1.8104 0.7122 0.3462 2.6747 5.7672 10.5532 1.9111 0.8509 2.1677 5.7534 14.2855 6.8110 7.9942 5.9795 8.7947 8.0804 4.6971 0.4847 5.1872 2.1132 2.2074 12.7204 28.2533 24.5167 33.6014 15.5724 49.0772 0.1026 8.4736 9.3145 23.0755 8.8589 20.2856 4.1655 2.4422 21.6240 4.7481 66.0077 8.4797 43.1980 47.0378 49.7907 16.2173 108.0331 76.6625 12.7127 0.0626 0.0639 76.9911 58.0193 2.8218 580.9797 20.2485 5.3904 45.3277 11.8623 12.3165 114.4097 18.4994 49.2765 22.6812 80.5644 12.5013 26.1182 50.9886 13.8168 38.3785 14.0051 10.6940 17.4209 5.8755 32.2114 120.9032 2.2553 28.9877 29.8886 26.5856 492.1083 108.7308 31.1891 23.2540 39.7798 53.4169 31.4862 17.1843 9.8416 17.2040 10.1385 37.9513 42.1416 8.1842 43.7567 12.4193 16.7259 14.3514 6.6561 2.3972 9.8935
temp: 298.150 k
press: 1.00000 atm
elementType: 17 8 8 8 8 7 6 6 6 6 6 6 6 6 6 6 6 6 6 6 1 1 1 1 1 1 1 1 1 1 1 1 1 1 1 1 1 1
symmnumber: 1
zpe: 787001.9 jmol-1
zpe.correction: 0.299753 hartree
zpe.thermalcorrener: 0.321785 hartree
zpe.thermalcorrenthalpy: 0.322729 hartree
zpe.thermalcorrgfe: 0.245749 hartree
zpe.sumelectzpe: -1358.490089 hartree
zpe.sumelectthermal: -1358.468057 hartree
zpe.sumelectthermalent: -1358.467112 hartree
zpe.sumelectthermalfe: -1358.544093 hartree
dipole: 0.9430 -4.0743 -0.0211
dipole: 4.1820
quadrupole: -141.8018 -100.8109 -124.5865
quadrupole: 4.4866 -0.7709 0.8119
quadrupole: -19.4021 21.5889 -2.1868 4.4866 -0.7709 0.8119
hfenergy: -1358.7898419 hartree
pointgroup: C01 [X(C14H18Cl1N1O4)]
dipole: -0.2343153 1.6284584 0.0184961 debye
polarizability: 254.5434595|-4.3501859|235.3926776|1.9678827|-0.1786449|103.2891552 unknown
InChI: InChI=1S/C14H18ClNO4/c1-4-16(6-5-15)12-8-10(13(17)19-2)7-11(9-12)14(18)20-3/h7-9H,4-6H2,1-3H3
charge 0 multiplicity 1
38 atoms
Cl 5.64124 -0.555148 -0.625267
O  -2.823533 2.648344 -0.08765
O  -1.548847 -3.616347 0.229439
O  -4.074659 0.684788 -0.072357
O  0.778065 -3.661879 0.297577
N  2.03994 1.35537 0.159911
C  0.836036 0.631431 0.143641
C  3.334368 0.690033 0.381507
C  2.055118 2.831299 0.06299
C  0.824338 -0.794647 0.196968
C  -0.426328 1.295903 0.066968
C  -0.390852 -1.517108 0.179336
C  -1.634387 0.561743 0.039075
C  3.940645 0.207332 -0.950078
C  1.816605 3.541877 1.41614
C  -1.634202 -0.851243 0.097618
C  -2.95605 1.252724 -0.043363
C  -0.293439 -3.00713 0.240853
C  -4.096572 3.400186 -0.169667
C  -1.540147 -5.096067 0.290724
H  3.232554 -0.16043 1.078704
H  4.030034 1.405153 0.855705
H  3.040206 3.130854 -0.340619
H  1.306829 3.159318 -0.682093
H  1.746219 -1.38117 0.247199
H  -0.494796 2.384466 0.036913
H  4.113663 1.037466 -1.651211
H  3.343355 -0.582715 -1.427492
H  1.851104 4.639478 1.287525
H  2.592285 3.257694 2.150059
H  0.833812 3.274013 1.840518
H  -2.574989 -1.404661 0.079497
H  -3.79895 4.458201 -0.182152
H  -4.731266 3.174799 0.703846
H  -4.642141 3.129374 -1.089367
H  -1.00173 -5.51154 -0.577758
H  -2.600827 -5.38262 0.275228
H  -1.047898 -5.437242 1.217032
