program: Gaussian 09
title: 000235468
version: EM64L-G09RevD.01
frameworkgroup: C1[X(C23H25BrN4)]
method: RPBEPBE
basis: SDD
operation: Freq
keyword: #p
keyword: freq=noraman
keyword: PBEPBE/SDD
title: #p freq=noraman PBEPBE/SDD
converged: YES YES NO NO
title: Mulliken charges:
elementType: Br N N N N C C C C C C C C C C C C C C C C C C C C C C C H H H H H H H H H H H H H H H H H H H H H H H H H
charge: -0.049679 -0.100573 -0.408360 -0.140704 -0.359733 -0.005080 -0.452224 -0.540483 -0.495312 0.141066 0.048505 -0.769010 0.157157 -0.040838 -0.528407 -0.517503 0.489458 0.484085 -0.370141 -0.449834 -0.444024 -0.376738 -0.229504 -0.218171 -0.242082 -0.218866 -0.227222 -0.244013 0.259249 0.210678 0.218193 0.219643 0.230823 0.244767 0.235463 0.276861 0.287157 0.322903 0.220899 0.268056 0.314944 0.263506 0.218510 0.248852 0.231422 0.230019 0.249623 0.225476 0.226137 0.228913 0.224648 0.224137 0.227351
chargesum: 0.00000
title: Mulliken charges with hydrogens summed into heavy atoms:
elementType: Br N N N N C C C C C C C C C C C C C C C C C C C C C C C
charge: -0.049679 -0.100573 -0.085458 -0.140704 -0.044789 0.254169 -0.023353 -0.090018 -0.015081 0.141066 0.048505 -0.204992 0.157157 -0.040838 -0.039452 -0.035488 0.489458 0.484085 -0.121289 -0.218412 -0.214005 -0.127115 -0.004028 0.007967 -0.013169 0.005781 -0.003084 -0.016662
polarizability: 3.54923127e+02 1.56675513e+01 3.02534600e+02 -4.14322029e+00 -1.21180765e+01 2.37348665e+02
1716.lowfreq: -2.6168 -0.0008 -0.0004 -0.0001 2.5276 4.5336 9.0437 11.7106 15.7346
frequency: 8.0758 11.1913 15.5248 22.7877 25.8879 30.6177 34.5432 51.8111 97.2717 102.0667 116.8482 138.0238 146.4034 167.2660 195.0345 197.1285 211.3656 237.2511 249.2021 259.3657 272.2899 289.6789 310.9202 362.3779 397.8169 403.3408 404.3558 420.4545 439.6783 461.6908 465.5318 507.2318 519.3047 532.4150 539.7091 557.9721 586.3237 590.5555 606.1654 613.9480 617.2251 617.5505 665.5670 688.0035 696.5237 704.5955 705.2673 747.4712 752.3765 762.1682 769.3718 804.7570 810.4578 827.6795 853.0381 853.6400 855.3398 868.6514 905.9901 911.9470 916.3590 935.9538 962.8898 976.4362 977.7949 984.9182 989.9030 990.2418 994.9076 997.1934 1006.8990 1025.4766 1026.0971 1044.6884 1054.0658 1068.9381 1080.0550 1086.0525 1096.2645 1119.1953 1135.4747 1139.6550 1146.4494 1170.8218 1171.9228 1183.2134 1185.9173 1191.8415 1203.4580 1211.0548 1213.0871 1225.0227 1235.7684 1238.9586 1260.2764 1262.3964 1289.6802 1297.3923 1306.2370 1313.8873 1314.2002 1332.3244 1343.2364 1347.6985 1358.5081 1365.3562 1385.5601 1386.9431 1405.9963 1434.1761 1439.4046 1441.8267 1443.0322 1455.5481 1461.0753 1467.8498 1471.6865 1473.5028 1484.8006 1485.0438 1491.8459 1523.7665 1561.2297 1574.0796 1595.4235 1596.0345 1614.8376 1615.0214 2918.2665 2963.7313 2974.3820 2975.1778 2979.4246 2981.4957 2998.4662 3037.7484 3039.4713 3040.1530 3049.6729 3054.8286 3112.2192 3114.0569 3122.8003 3123.0990 3126.1157 3134.7911 3135.3152 3145.5654 3146.1644 3161.8015 3162.8895 3566.0974 3576.8853
redmass: 5.4689 6.4177 4.9426 4.5407 4.5080 4.9835 5.0184 6.8624 4.0070 3.2889 4.0740 4.4389 5.8763 4.0083 3.9511 3.9626 3.8535 2.9026 3.9869 4.0348 3.4348 3.5157 3.9850 2.9520 3.2865 2.7972 2.8457 2.1756 2.8983 3.4163 3.3815 1.4332 2.3122 4.5230 4.1317 3.3510 1.6854 4.5435 2.6984 4.9165 6.1969 6.1666 4.6832 4.0541 7.6220 1.8618 1.8612 1.7692 1.9011 2.9930 6.8016 4.0044 3.8062 2.4792 1.4889 1.3285 1.2583 2.7586 1.4451 1.4218 1.5689 2.5146 2.6379 1.3920 1.3941 1.7781 6.2480 5.6762 1.3346 1.4196 2.2077 2.2012 2.1958 1.6926 2.9932 2.9805 1.7418 1.5773 2.7149 2.3406 2.1699 1.2073 2.1117 1.0567 1.0544 1.1159 1.1209 2.4602 1.3157 2.4550 2.5920 1.4095 1.2930 1.2238 1.5040 2.0169 1.7467 1.2614 1.5733 1.3818 1.5284 1.4435 1.4010 1.4540 1.9617 1.6412 6.7432 5.7332 2.0950 2.1106 1.1109 2.1418 2.0072 1.2210 1.1577 1.1951 1.2249 1.1622 2.2941 1.9851 2.3985 3.3020 4.9462 4.6985 6.0629 6.0622 6.0433 6.0126 1.0642 1.0665 1.0657 1.0671 1.0812 1.0680 1.0877 1.0982 1.0933 1.0582 1.0947 1.0971 1.0871 1.0874 1.0859 1.0859 1.1104 1.0912 1.0912 1.0959 1.0961 1.1015 1.1015 1.0765 1.0766
irintensity: 0.0030 0.0226 0.0446 0.2262 0.0761 0.0758 1.5325 0.8231 2.1311 0.2988 0.0914 2.5275 4.8770 0.8034 0.5712 2.0010 1.2915 0.9068 0.4631 0.2568 3.3336 5.7034 2.1160 6.0764 0.9839 1.2532 1.1645 4.0083 1.0072 0.3794 4.0754 97.2657 20.8073 18.5317 27.5769 5.4327 99.8912 4.8168 9.2694 46.5986 2.6904 5.8068 10.6752 3.2748 2.4349 32.2327 50.2285 40.2613 46.7816 18.5936 14.5066 9.0340 5.5076 0.7857 13.4496 3.1890 1.3551 0.7830 4.2170 4.8648 2.6182 14.1082 29.3091 0.3852 0.1342 6.6952 0.2558 0.5758 0.2258 0.9141 18.3885 15.1712 10.0912 1.1417 3.7962 16.3452 17.7548 10.3875 5.2255 14.0826 2.5380 6.0276 15.9689 0.0691 0.0471 10.2380 2.8633 24.4119 1.5062 5.8675 2.8873 38.2981 58.9252 23.7260 48.0906 67.8145 11.1893 25.1985 13.6219 5.7626 7.6638 0.7308 22.1328 24.5452 1.4781 0.5898 27.8879 26.4908 62.6925 103.6841 9.2139 24.5455 5.3856 31.9985 14.6823 26.3788 61.4099 1.8560 51.3476 7.0136 162.2295 454.9022 493.3410 640.5540 5.7751 17.6162 2.5619 15.1831 37.7268 67.8559 71.0535 28.0627 7.8318 13.5986 24.4466 54.4224 10.2621 20.6165 17.2711 23.3455 8.7217 8.8851 0.7144 0.9582 13.1951 13.7667 16.6176 42.1528 44.8046 25.3987 24.8170 59.1075 34.9860
temp: 298.150 k
press: 1.00000 atm
elementType: 35 7 7 7 7 6 6 6 6 6 6 6 6 6 6 6 6 6 6 6 6 6 6 6 6 6 6 6 1 1 1 1 1 1 1 1 1 1 1 1 1 1 1 1 1 1 1 1 1 1 1 1 1
symmnumber: 1
zpe: 1137914.9 jmol-1
zpe.correction: 0.433409 hartree
zpe.thermalcorrener: 0.458905 hartree
zpe.thermalcorrenthalpy: 0.459849 hartree
zpe.thermalcorrgfe: 0.370755 hartree
zpe.sumelectzpe: -1121.939789 hartree
zpe.sumelectthermal: -1121.914293 hartree
zpe.sumelectthermalent: -1121.913349 hartree
zpe.sumelectthermalfe: -1122.002443 hartree
dipole: -0.4372 0.3620 1.0532
dipole: 1.1964
quadrupole: -179.4481 -166.9974 -162.7808
quadrupole: -4.8648 7.0559 -2.8003
quadrupole: -9.7060 2.7447 6.9613 -4.8648 7.0559 -2.8003
hfenergy: -1122.3731981 hartree
pointgroup: C01 [X(C23H25Br1N4)]
dipole: 0.0684975 -0.1865276 0.4266934 debye
polarizability: 354.815671|-14.5966266|302.9061612|12.8304669|4.4841543|237.0845599 unknown
InChI: InChI=1S/C23H25BrN4/c24-14-19-11-12-21-20(13-19)22(25-15-17-7-3-1-4-8-17)28-23(27-21)26-16-18-9-5-2-6-10-18/h1-10,19,25-26H,11-16H2
charge 0 multiplicity 1
53 atoms
Br -5.840687 3.681375 -0.713739
N  1.098608 2.618206 -0.244222
N  -1.854962 -0.256676 -0.933771
N  0.410847 0.372156 -0.919468
N  2.677804 1.030854 -0.893276
C  -2.964376 3.929933 0.055024
C  -1.902583 4.524543 1.023613
C  -2.741917 2.404735 -0.089108
C  -0.488739 4.355271 0.428638
C  -1.280957 2.03752 -0.292324
C  -0.221082 2.940547 -0.053866
C  -4.363212 4.281249 0.564277
C  -0.89571 0.717889 -0.718547
C  1.347368 1.341719 -0.685995
C  -1.557401 -1.624779 -1.383348
C  3.169048 -0.258896 -1.379622
C  -2.088515 -2.690452 -0.428922
C  4.178256 -0.920617 -0.44189
C  -1.790611 -2.628133 0.957231
C  -2.867943 -3.769028 -0.91341
C  5.308417 -1.593522 -0.967971
C  3.984957 -0.902268 0.962845
C  -2.259576 -3.626813 1.837465
C  -3.338504 -4.772074 -0.034062
C  -3.035756 -4.703518 1.34454
C  6.223935 -2.246339 -0.110658
C  4.89903 -1.550624 1.821964
C  6.021599 -2.227355 1.288224
H  -2.819665 4.40436 -0.936598
H  -2.102906 5.597655 1.208096
H  -1.964727 4.005402 2.00122
H  -3.143966 1.899832 0.818744
H  -3.355942 2.045277 -0.940426
H  0.289042 4.621161 1.166831
H  -0.351663 5.049135 -0.425233
H  -4.608437 3.782344 1.51629
H  -4.516995 5.368275 0.647633
H  -2.829736 -0.020349 -0.751607
H  -1.973905 -1.792927 -2.396928
H  -0.456871 -1.678573 -1.462993
H  3.334721 1.786701 -0.694901
H  2.27411 -0.89761 -1.494821
H  3.621866 -0.14817 -2.3864
H  -1.188475 -1.794688 1.337929
H  -3.10895 -3.824737 -1.982732
H  5.474116 -1.6063 -2.052995
H  3.117912 -0.37308 1.374709
H  -2.018929 -3.570622 2.905277
H  -3.94182 -5.600346 -0.422631
H  -3.400709 -5.478193 2.028229
H  7.094574 -2.761874 -0.531954
H  4.737754 -1.529946 2.90595
H  6.731759 -2.729328 1.954989
