program: Gaussian 09
title: 000235466
version: EM64L-G09RevD.01
frameworkgroup: C1[X(C5H6N4O3)]
method: RPBEPBE
basis: SDD
operation: Freq
keyword: #pfreq=noraman
keyword: PBEPBE/SDD
title: #p freq=noraman PBEPBE/SDD
converged: NO NO NO NO
title: Mulliken charges:
elementType: O O O N N N N C C C C C H H H H H H
charge: -0.275516 -0.300856 -0.228812 -0.398576 -0.346467 -0.398449 -0.499250 0.092607 0.183935 -0.203061 0.177598 0.164490 0.311357 0.371578 0.360001 0.381422 0.304007 0.303993
chargesum: 0.00000
title: Mulliken charges with hydrogens summed into heavy atoms:
elementType: O O O N N N N C C C C C
charge: -0.275516 -0.300856 -0.228812 -0.026998 0.013535 -0.017026 0.108749 0.092607 0.183935 0.108295 0.177598 0.164490
polarizability: 1.45813307e+02 -9.03636516e+00 9.55096746e+01 1.31432171e-02 -9.55277309e-03 4.18665941e+01
1716.lowfreq: -65.2734 -0.0009 0.0001 0.0004 4.4427 6.1458 8.1335 67.6807 93.1655
frequency: -64.7688 67.6791 93.1364 161.3895 171.3391 174.5751 280.1432 303.1637 318.6005 370.9156 404.3475 422.6267 528.1897 586.8424 613.4198 658.7374 676.9263 714.9010 752.1100 762.9959 773.8909 779.2359 796.4110 853.5565 942.0001 966.5713 1066.0843 1123.0946 1174.3103 1205.6213 1282.8662 1285.9725 1300.0247 1361.5618 1386.0357 1453.4617 1491.8110 1572.1448 1594.0462 1655.6521 1673.1771 1688.6580 3165.0549 3382.6178 3409.6598 3502.2777 3519.7104 3554.4715
redmass: 1.1814 8.0999 6.2326 5.8208 5.1057 4.7957 6.6318 6.5271 6.4051 11.5958 9.5134 3.2618 8.7787 6.2948 6.6333 2.0696 2.4878 2.0870 6.5040 2.3296 1.7183 1.2344 2.7671 7.5180 3.4039 1.3694 4.9793 3.6585 2.2434 3.1249 1.1586 2.9657 2.2433 1.8752 2.5984 2.6017 1.8456 8.4806 5.3008 4.5619 1.1621 5.0890 1.0948 1.0474 1.0785 1.0985 1.0771 1.0788
irintensity: 49.1675 0.2469 5.4116 3.5507 13.5338 1.5696 19.9792 2.0293 28.3990 11.8616 15.8921 12.1987 8.9399 4.4544 12.7224 12.3969 91.9799 11.9049 5.4311 29.5525 119.8167 84.4459 199.7516 22.4038 6.6744 12.0476 15.1292 6.2517 88.1997 23.0836 0.1566 9.0468 82.2076 28.7919 96.6080 81.4158 269.1129 122.9240 70.1636 412.7913 12.2628 736.9617 3.0372 10.8298 113.3221 1.8036 64.6497 106.7737
temp: 298.150 k
press: 1.00000 atm
elementType: 8 8 8 7 7 7 7 6 6 6 6 6 1 1 1 1 1 1
symmnumber: 1
zpe: 335086.1 jmol-1
zpe.correction: 0.127628 hartree
zpe.thermalcorrener: 0.137662 hartree
zpe.thermalcorrenthalpy: 0.138606 hartree
zpe.thermalcorrgfe: 0.091672 hartree
zpe.sumelectzpe: -637.956842 hartree
zpe.sumelectthermal: -637.946807 hartree
zpe.sumelectthermalent: -637.945863 hartree
zpe.sumelectthermalfe: -637.992797 hartree
dipole: 0.9899 -2.1380 0.0027
dipole: 2.3561
quadrupole: -79.3472 -70.1331 -67.4221
quadrupole: -3.2562 0.0118 -0.0146
quadrupole: -7.0464 2.1677 4.8787 -3.2562 0.0118 -0.0146
hfenergy: -638.0844692 hartree
pointgroup: C01 [X(C5H6N4O3)]
dipole: -0.3384207 -0.8579328 -0.0931218 debye
dipolederiv: -0.7863188 -0.1738366 0.002807 -0.3224705 -1.0604947 -0.0719657 -0.0167078 -0.0817858 -0.3717835 -0.7799757 0.2589605 0.057724 0.1494335 -0.8796433 -0.0738089 0.043707 -0.0809205 -0.3922082 -1.511115 -0.0632157 0.0596104 0.049717 -0.460101 -0.0138375 0.0748303 -0.0070371 -0.3828224 -1.181704 -0.3267742 0.0075469 -0.3911419 -0.5201927 -0.0000743 -0.0006251 -0.0039546 -0.3406579 -1.4041344 -0.2714494 0.0305451 0.5950311 -0.4556503 -0.0555253 0.1442773 -0.00331 -0.3133078 -0.3616889 -0.1730526 -0.0266883 -0.3816506 -0.6187316 -0.0021843 -0.0535146 -0.0145623 -0.4275627 -0.2068423 -0.1026233 -0.0030544 -0.1596979 -0.3737223 -0.0329974 -0.0105463 -0.0366911 -0.044385 -0.7203578 0.0670985 0.0470932 -0.2875876 -0.7708836 -0.0727545 -0.0001632 -0.0941011 -0.0962397 1.223008 0.1175936 -0.0414741 0.3062334 1.3563507 0.1228524 -0.0166299 0.1346126 0.2963176 1.0821006 0.5545497 0.0103599 0.3318568 0.3562139 0.0210421 -0.0190764 0.0077006 0.0455691 1.4042919 -0.0077789 -0.0727097 0.1132226 1.1630734 0.1168916 -0.0569603 0.1245656 0.2287089 2.1116047 0.1168605 -0.0909993 -0.305194 1.0061329 0.1060959 -0.1465984 0.0807562 0.3567385 0.157172 0.0326718 0.0049078 0.0195788 0.081636 -0.0124176 0.0032764 -0.0131393 0.1654405 0.1626241 -0.0438718 0.0051515 -0.0423848 0.2220579 -0.0134739 0.0053929 -0.013389 0.3420602 0.1802285 0.028819 0.0142652 0.0953622 0.2746078 -0.0163307 0.0229294 -0.0124611 0.3522826 0.3736164 -0.0161813 -0.0035267 -0.0861377 0.2758466 -0.0043834 -0.012584 -0.0082894 0.3499033 0.1246032 -0.0010876 -0.0296435 0.1533559 0.2330906 -0.1498813 -0.0213344 -0.0807033 0.0885766 0.1328873 0.0033177 0.0280848 0.1624737 0.1704098 0.1527528 0.0603272 0.1027099 0.1433698 unknown
polarizability: 144.2051989|12.6173978|96.0153339|-4.4944459|6.3451754|42.9690428 unknown
InChI: InChI=1S/C5H6N4O3/c6-9-4(11)2-1-7-5(12)8-3(2)10/h1,7-9H,6H2
charge 0 multiplicity 1
18 atoms
O  0.155423 2.228727 0.169478
O  2.278508 -1.517354 -0.448778
O  -3.88409 -0.126462 0.102554
N  -1.823673 1.011454 0.12828
N  -1.878244 -1.315379 -0.174032
N  2.503139 0.789861 -0.16222
N  3.923653 0.781872 -0.24954
C  0.266545 -0.196622 -0.155816
C  -0.404585 1.093337 0.053168
C  -0.50303 -1.339409 -0.259653
C  1.7566 -0.367004 -0.267322
C  -2.630218 -0.130887 0.026444
H  -0.00509 -2.301713 -0.415556
H  -2.317654 1.898419 0.274754
H  -2.430763 -2.171989 -0.253679
H  2.033985 1.695832 -0.016861
H  4.220438 0.417315 -1.166879
H  4.322254 0.203601 0.504957
