program: Gaussian 09
title: 000235465
version: EM64L-G09RevD.01
frameworkgroup: C1[X(C24H33NO2)]
method: RPBEPBE
basis: SDD
operation: Freq
keyword: #p
keyword: freq=noraman
keyword: PBEPBE/SDD
title: #p freq=noraman PBEPBE/SDD
converged: YES YES NO NO
title: Mulliken charges:
elementType: O O N C C C C C C C C C C C C C C C C C C C C C C C C H H H H H H H H H H H H H H H H H H H H H H H H H H H H H H H H H
charge: -0.181489 -0.440711 -0.096776 -0.145908 0.302067 -0.090317 -0.183642 -0.524307 -0.549896 -0.485109 -0.508621 0.042590 -0.508551 0.266320 -0.796133 -0.584793 0.341641 -0.547493 -0.614559 0.303858 0.078484 -0.477651 -0.365366 -0.354194 -0.397975 -0.390995 -0.399069 0.217510 0.235094 0.208323 0.213272 0.225432 0.230653 0.217606 0.219978 0.207666 0.214940 0.217142 0.246929 0.246393 0.236109 0.226889 0.240232 0.219922 0.224031 0.270629 0.218469 0.221970 0.227165 0.228873 0.177640 0.165235 0.209404 0.202530 0.190936 0.189658 0.202315 0.353602 0.189254 0.212794
chargesum: 0.00000
title: Mulliken charges with hydrogens summed into heavy atoms:
elementType: O O N C C C C C C C C C C C C C C C C C C C C C C C C
charge: -0.181489 -0.087109 -0.096776 0.071602 0.302067 0.144777 0.024681 -0.085603 -0.101637 -0.057466 -0.076539 0.042590 -0.015228 0.266320 -0.092903 -0.140840 0.341641 -0.276864 -0.396089 0.303858 0.078484 -0.028516 0.041146 0.020445 -0.004509 0.000978 0.002979
polarizability: 3.22581668e+02 2.12318828e+00 2.81491300e+02 -1.87342169e+00 1.05623930e+01 1.86368255e+02
1716.lowfreq: -5.5566 -4.0401 -0.0004 0.0007 0.0008 4.2797 17.9652 27.7819 37.8187
frequency: 17.6033 27.4568 37.7602 50.8635 58.8208 76.3565 98.8769 119.9139 140.6722 149.5738 161.6627 184.9056 206.3869 215.9156 227.4072 232.1123 246.5361 255.9483 268.9606 274.4791 286.9514 306.4300 313.9805 349.9128 358.0087 373.3906 382.7556 390.0186 404.9928 433.1363 440.2546 446.5665 452.6009 479.6884 499.3349 509.0186 524.5618 543.2601 563.4872 573.9162 579.9152 592.3471 626.7283 642.1222 696.2767 710.3970 716.4387 765.3622 768.8302 805.0478 807.9066 819.4912 823.2823 834.0038 852.1631 852.9865 857.9056 861.9173 887.4581 902.5628 920.5846 932.6821 941.0879 960.5077 961.5906 985.0345 988.7540 996.0796 998.4668 1006.9567 1012.9332 1033.0649 1047.0972 1054.6650 1067.0173 1078.2932 1082.4723 1085.4152 1107.3965 1112.7020 1122.6732 1124.7355 1130.4448 1138.9968 1149.1528 1153.9489 1155.7502 1168.3773 1182.8366 1190.7848 1195.9536 1197.2093 1209.8195 1222.5707 1238.0587 1240.0073 1250.8743 1252.4558 1259.1407 1263.1068 1264.5265 1276.9092 1283.9883 1287.6933 1292.2099 1292.7041 1293.6278 1316.1497 1321.2717 1324.8407 1328.8064 1332.5675 1339.9141 1340.9880 1342.8199 1349.6378 1354.7172 1362.7896 1371.5216 1379.5377 1382.2530 1391.7574 1410.4746 1427.6301 1453.3051 1457.5330 1459.3289 1461.0704 1461.7990 1467.8275 1469.5628 1471.4345 1472.3644 1473.9734 1482.5926 1486.6415 1489.7466 1503.6673 1596.7931 1621.9722 1653.0897 2819.7306 2830.9756 2892.9261 2896.2644 2902.6827 2953.5076 2956.0500 2966.4007 2971.2092 2978.0641 2982.0152 2984.0440 2984.5928 2987.9478 2989.6286 2997.7317 3004.5248 3012.4177 3020.6458 3031.1996 3034.3396 3037.5786 3040.2512 3042.8658 3048.9653 3052.2457 3055.2106 3070.4035 3077.3951 3085.8048 3089.5986 3144.9454 3579.8353
redmass: 3.4717 4.1673 3.9667 3.7548 3.7927 4.3470 4.4479 2.6799 2.5989 2.8767 1.7228 2.8111 1.9225 3.4818 3.0327 3.5615 2.3600 2.7248 2.9345 2.9559 2.8901 2.0176 2.6693 2.4281 1.2447 2.9044 2.7119 2.0971 3.8196 3.4163 3.7744 2.7745 3.0100 2.9427 2.8945 3.9338 2.4389 2.2828 3.4518 3.5318 2.9118 3.1202 3.8719 4.8396 2.9128 3.9570 3.0552 3.6707 3.9091 2.5676 1.5023 1.8774 1.7558 1.6074 2.1698 2.5953 1.6035 2.0194 2.2631 2.2460 2.0053 1.4675 1.6545 1.3682 2.1436 2.2027 2.0863 2.0115 2.0047 2.3531 1.8104 2.0093 2.1402 3.2732 2.7039 2.1235 1.4522 2.2397 2.4052 2.2600 2.6397 2.2797 1.7441 1.5258 1.3674 1.7126 1.8384 1.7591 1.4748 1.3528 1.7466 1.3743 1.9686 1.6272 1.3728 1.7314 1.6265 1.3521 1.4656 1.3421 1.2472 2.2435 1.3898 1.6495 1.4685 1.4401 1.3580 1.3779 1.5792 1.3528 1.5106 1.3904 1.4161 1.5071 1.4471 1.4991 1.5226 1.4687 1.5313 2.2362 1.2461 2.4879 3.2780 1.0807 1.0905 1.1300 1.0729 1.0858 1.0885 1.0890 1.0763 1.0883 1.0872 1.0848 1.0978 1.0644 1.0773 3.0650 7.1566 7.1051 12.0503 1.0716 1.0703 1.0686 1.0809 1.0796 1.0640 1.0803 1.0621 1.0658 1.0624 1.0616 1.0616 1.0510 1.0470 1.0884 1.0594 1.0655 1.0938 1.0875 1.0946 1.1014 1.0887 1.0963 1.1029 1.1020 1.1037 1.0988 1.1020 1.0993 1.0903 1.0988 1.0892 1.0659
irintensity: 0.4420 0.1631 0.1245 1.0289 0.2003 4.3839 0.1000 0.5489 1.8210 3.1584 1.7975 0.0218 0.2307 0.7737 2.5043 0.6347 4.0204 0.2153 2.4751 2.8559 0.5595 3.4825 3.6340 9.9856 102.0477 5.5245 4.4080 2.4571 1.7622 2.0797 0.3166 11.0576 2.4200 1.3687 6.6332 0.8898 9.0916 5.0970 4.4533 2.0791 0.5645 4.6936 11.6145 0.9333 4.6317 0.7545 0.4558 6.7716 0.3069 1.2111 0.1780 15.0104 10.6819 7.4390 7.3542 4.3237 7.1361 13.4852 9.2332 5.4218 7.1350 8.8003 3.5463 2.5480 6.6115 18.9028 14.8740 22.2575 2.2021 30.9796 5.5938 27.9938 8.2579 21.3963 25.2667 8.9568 1.6373 57.3916 24.3873 25.8830 3.5886 12.4568 7.8639 68.1843 4.3888 14.4999 17.2069 10.4166 26.4205 5.8097 7.3113 0.7970 1.3519 10.5820 12.8466 29.4876 0.7220 14.2451 2.3858 30.7790 11.6329 19.4777 13.1935 20.3223 4.2250 5.0737 3.9143 1.7885 23.5464 6.7787 1.9596 1.2538 0.5730 13.3979 1.4303 1.1076 1.4082 5.2482 5.2502 1.6603 17.0561 21.7907 28.9496 18.1295 7.7671 12.7093 7.7027 18.3832 4.8101 3.2982 14.1658 7.9170 7.3018 5.8766 11.9022 9.5032 10.2266 70.7383 11.5367 12.2577 191.3030 53.4764 171.3187 62.5518 4.3626 27.9705 32.1140 11.2442 43.2304 42.6647 28.0618 31.2370 39.8061 10.4723 37.1190 13.0434 28.0895 14.5108 42.5820 65.3888 75.3748 51.1854 20.2510 32.0576 20.2252 43.8784 106.2378 11.8563 41.0267 19.1661 29.2289 26.7032 2.9640 28.8633
temp: 298.150 k
press: 1.00000 atm
elementType: 8 8 7 6 6 6 6 6 6 6 6 6 6 6 6 6 6 6 6 6 6 6 6 6 6 6 6 1 1 1 1 1 1 1 1 1 1 1 1 1 1 1 1 1 1 1 1 1 1 1 1 1 1 1 1 1 1 1 1 1
symmnumber: 1
zpe: 1366023.9 jmol-1
zpe.correction: 0.520291 hartree
zpe.thermalcorrener: 0.545151 hartree
zpe.thermalcorrenthalpy: 0.546095 hartree
zpe.thermalcorrgfe: 0.465769 hartree
zpe.sumelectzpe: -1137.506868 hartree
zpe.sumelectthermal: -1137.482008 hartree
zpe.sumelectthermalent: -1137.481064 hartree
zpe.sumelectthermalfe: -1137.561391 hartree
dipole: 0.7051 3.9950 1.3993
dipole: 4.2913
quadrupole: -166.9265 -161.2033 -161.2536
quadrupole: -19.4018 -3.1174 -0.0096
quadrupole: -3.7987 1.9244 1.8742 -19.4018 -3.1174 -0.0096
hfenergy: -1138.0271594 hartree
pointgroup: C01 [X(C24H33N1O2)]
dipole: 0.2947883 -1.5711978 -0.5430228 debye
polarizability: 322.5677535|-1.88943|281.5242911|3.0531231|10.268715|186.3491782 unknown
InChI: InChI=1S/C24H33NO2/c1-24-10-9-18-19(21(24)7-8-23(24)27)6-5-16-14-22(26)17(13-20(16)18)15-25-11-3-2-4-12-25/h13-14,18-19,21,26H,2-12,15H2,1H3
charge 0 multiplicity 1
60 atoms
O  -5.151866 3.037492 0.41492
O  3.718398 -3.46284 -0.301373
N  3.970972 0.741064 0.284224
C  -3.608941 -0.18776 0.214545
C  -3.462573 1.306037 -0.21168
C  -2.37289 -1.0203 -0.165311
C  -1.126644 -0.399926 0.547931
C  -2.264347 1.934127 0.527986
C  -5.02553 -0.586114 -0.278631
C  -0.968516 1.121622 0.253418
C  -2.485079 -2.510223 0.222194
C  -4.862157 1.850714 0.129639
C  -5.870372 0.678896 0.052963
C  0.14293 -1.22318 0.270216
C  -3.325102 1.510432 -1.756366
C  -1.280605 -3.298338 -0.332074
C  0.056821 -2.596339 -0.103428
C  1.432104 -0.653213 0.429999
C  1.248411 -3.335824 -0.296358
C  2.628021 -1.37438 0.23311
C  2.515027 -2.739346 -0.129332
C  3.996309 -0.733131 0.441681
C  3.867784 1.150513 -1.140339
C  5.112148 1.408161 0.958392
C  3.677208 2.675457 -1.265192
C  4.96263 2.942496 0.903908
C  4.82564 3.430588 -0.557152
H  -3.65783 -0.184432 1.329862
H  -2.221184 -0.968626 -1.265195
H  -1.339642 -0.483419 1.640527
H  -2.472857 1.938458 1.617087
H  -2.125286 2.989181 0.226607
H  -5.414235 -1.487187 0.226338
H  -5.024742 -0.792852 -1.365334
H  -0.640614 1.259236 -0.795846
H  -0.16197 1.539673 0.883532
H  -3.423832 -2.946951 -0.169389
H  -2.522663 -2.595634 1.327845
H  -6.362877 0.592282 1.041077
H  -6.669549 0.904307 -0.676025
H  -2.393774 1.063418 -2.141891
H  -4.166872 1.068575 -2.319451
H  -3.30374 2.592796 -1.977258
H  -1.422575 -3.444872 -1.423825
H  -1.249162 -4.313151 0.110603
H  1.554691 0.397296 0.71224
H  1.178534 -4.396921 -0.5785
H  4.342476 -0.956604 1.471298
H  4.733884 -1.220295 -0.240037
H  3.013025 0.617557 -1.594428
H  4.788055 0.845133 -1.70701
H  6.089662 1.121021 0.485244
H  5.143418 1.066754 2.010475
H  2.709863 2.952682 -0.801987
H  3.628031 2.954529 -2.335567
H  5.835847 3.415452 1.393619
H  4.058915 3.230832 1.475331
H  3.524632 -4.391458 -0.581783
H  5.776412 3.241998 -1.098286
H  4.649676 4.522738 -0.585765
