program: Gaussian 09
title: 000235460
version: EM64L-G09RevD.01
frameworkgroup: C1[X(C12H12O2)]
method: RPBEPBE
basis: SDD
operation: Freq
keyword: #pfreq=noraman
keyword: PBEPBE/SDD
title: #p freq=noraman PBEPBE/SDD
converged: YES YES NO YES
title: Mulliken charges:
elementType: O O C C C C C C C C C C C C H H H H H H H H H H H H
charge: -0.441933 -0.441934 0.258372 0.258373 0.372072 0.372073 -0.605228 -0.605228 0.107172 0.107173 -0.820520 -0.820520 -0.398403 -0.398403 0.274454 0.274453 0.223846 0.235174 0.223832 0.223865 0.223812 0.235174 0.214791 0.214791 0.356372 0.356372
chargesum: 0.00000
title: Mulliken charges with hydrogens summed into heavy atoms:
elementType: O O C C C C C C C C C C C C
charge: -0.085561 -0.085562 0.258372 0.258373 0.372072 0.372073 -0.330775 -0.330775 0.107172 0.107173 -0.137668 -0.137669 -0.183612 -0.183612
polarizability: 2.12283031e+02 5.45875175e-06 1.55807068e+02 9.39588785e-03 3.17879988e-03 6.35109952e+01
1716.lowfreq: -12.6306 0.0005 0.0006 0.0008 7.7583 9.1278 87.7247 114.5010 129.5303
frequency: 87.6733 114.4953 129.5289 142.9906 191.2931 192.4377 245.0259 282.8622 308.5044 314.5945 328.0683 339.5737 354.1760 377.3284 434.2663 438.5035 478.1809 488.5432 522.8584 565.9296 619.2362 635.6470 672.5175 711.9646 723.3788 772.4303 780.5809 787.1887 860.9746 908.7538 922.1663 984.9799 989.5609 1009.2784 1023.5227 1037.8785 1055.7220 1127.1092 1146.7383 1174.0607 1189.3007 1240.8883 1244.5892 1273.1691 1274.4639 1345.5391 1385.3721 1395.0831 1407.1604 1442.2223 1457.3966 1462.3862 1469.5706 1477.7421 1478.2666 1479.5670 1519.2238 1593.0781 1606.5357 1648.6361 2968.3549 2968.6935 3039.2089 3040.4747 3083.4837 3086.1339 3111.9241 3134.1996 3152.7640 3155.4566 3586.8607 3587.9046
redmass: 3.6363 3.6670 1.0437 4.8129 4.5373 1.1077 3.4550 3.1508 3.7584 2.2988 1.0848 1.3497 4.1822 5.4426 2.8857 9.1705 3.8805 5.4454 3.7999 3.6660 3.7442 4.5082 3.5307 6.6392 7.5136 3.7772 1.4376 3.8948 1.3618 1.3773 1.4506 1.7878 5.1829 1.5735 1.8562 1.4541 1.6509 2.1066 1.3556 1.4098 1.9032 2.3947 1.7408 1.4175 3.8435 3.7660 3.7785 1.2424 1.2638 5.9896 1.3810 1.0470 2.0270 1.0458 1.6693 1.9527 3.3481 7.5528 6.5892 7.1364 1.0384 1.0375 1.0968 1.0967 1.0984 1.0978 1.0870 1.0961 1.0913 1.0917 1.0659 1.0660
irintensity: 0.0000 9.7668 0.0000 3.2916 8.7794 0.4299 0.0000 0.9087 0.0696 54.4047 0.0000 218.7148 4.7865 0.0000 7.5200 0.4531 6.7408 0.1882 0.0000 9.9695 8.5094 2.7016 0.0000 1.2626 46.3855 4.5512 72.2633 0.0000 0.0000 28.6677 0.0000 40.1888 73.6204 3.5177 1.1716 21.2132 0.0000 293.2966 4.5488 4.4183 56.7259 0.0019 115.2356 28.9258 4.5389 0.0797 6.7378 10.1018 12.1751 14.3688 77.6736 0.0004 26.5686 31.1385 10.1139 19.7170 2.4406 2.5688 62.7896 0.2968 8.5367 79.8640 46.5271 0.0002 38.6542 3.3211 23.9425 21.5398 4.7535 3.1777 55.0921 10.9610
temp: 298.150 k
press: 1.00000 atm
elementType: 8 8 6 6 6 6 6 6 6 6 6 6 6 6 1 1 1 1 1 1 1 1 1 1 1 1
symmnumber: 1
zpe: 541825.6 jmol-1
zpe.correction: 0.206370 hartree
zpe.thermalcorrener: 0.219229 hartree
zpe.thermalcorrenthalpy: 0.220173 hartree
zpe.thermalcorrgfe: 0.168352 hartree
zpe.sumelectzpe: -613.933242 hartree
zpe.sumelectthermal: -613.920384 hartree
zpe.sumelectthermalent: -613.919439 hartree
zpe.sumelectthermalfe: -613.971261 hartree
dipole: -1.8158 0.0000 0.0007
dipole: 1.8158
quadrupole: -58.6949 -75.0807 -87.3770
quadrupole: 0.0000 0.0016 0.0013
quadrupole: 15.0226 -1.3631 -13.6595 0.0000 0.0016 0.0013
hfenergy: -614.1396123 hartree
pointgroup: C01 [X(C12H12O2)]
dipole: 0.7143766 0.0000281 0.0002784 debye
dipolederiv: -0.0835088 -0.0366709 0.000004 -0.252031 -1.4231231 0.0000411 0.0000069 0.0000375 -0.402481 -0.0835288 0.0367627 0.0000527 0.252121 -1.4231013 0.0000043 0.0000518 -0.000044 -0.4024814 0.1640755 -0.1895732 0.0000109 0.0150563 -0.1639405 0.0000075 0.0000033 0.0000093 0.0277665 0.1640644 0.1895952 -0.0000044 -0.0150342 -0.1639298 0.0000053 0.0000199 0.0000145 0.0277666 0.2874999 -0.2318791 -0.0000495 -0.1866806 0.0568906 0.0000391 -0.0001023 0.0000593 -0.0529121 0.2874718 0.2318947 -0.0000951 0.1866968 0.0569185 -0.0000543 -0.0003283 -0.0001155 -0.0529122 -0.2327452 0.1165053 0.0000066 -0.0633205 0.0091569 -0.0000041 0.0000256 -0.0000157 -0.166509 -0.2327417 -0.1165216 0.0000211 0.063304 0.0091544 -0.0000185 0.0000246 0.000008 -0.1665088 -0.0203592 0.0550107 -0.0000044 0.3145711 1.2637431 -0.0000487 -0.0000086 -0.0000358 0.0103853 -0.0203341 -0.055099 -0.0000152 -0.3146579 1.2637158 -0.0000092 -0.0000161 -0.000003 0.0103852 -0.1422447 0.0975931 0.0000252 0.0320001 0.0408409 -0.0000091 0.000174 -0.0000143 0.0715618 -0.1422348 -0.0976053 0.000041 -0.032013 0.0408321 0.0000344 0.0003816 0.000098 0.0715623 -0.0040086 0.2795768 -0.000011 -0.2880186 -0.1303185 0.0000127 -0.0000089 -0.0000088 -0.2070044 -0.0040101 -0.2795674 -0.0000054 0.2880276 -0.1303166 -0.0000099 -0.0000199 -0.0000051 -0.2070039 0.0929375 0.0137646 -0.0000039 0.0387538 -0.0439338 0.0000066 -0.00001 0.0000119 0.1526538 0.0929411 -0.0137554 -0.0000089 -0.0387446 -0.0439376 0.0000036 -0.0000167 -0.0000127 0.1526536 -0.0556505 0.0150917 0.0909777 -0.0039976 0.0769337 0.0753335 0.1458207 0.02734 -0.0492368 0.0802947 -0.0940342 0.0000363 0.0394223 -0.1423292 0.000078 -0.0000218 0.0000795 0.1080883 -0.0557522 0.0149936 -0.0910077 -0.004193 0.0768832 -0.0754214 -0.1458506 -0.0274375 -0.0490396 -0.0556079 -0.0151689 0.0909745 0.0038846 0.0769691 -0.0752625 0.1458058 -0.0272766 -0.0493588 -0.0557937 -0.0149343 -0.0910209 0.0042885 0.0768461 0.0754798 -0.1458691 0.0274808 -0.0489179 0.0802909 0.094049 0.0000869 -0.0394073 -0.1423252 -0.0002113 -0.0000501 -0.0002089 0.108088 -0.0694151 -0.1051455 0.0000129 -0.1258821 -0.0112354 0.0000097 0.0000119 0.0000096 0.1777974 -0.0694305 0.1051415 0.0000104 0.1258782 -0.0112198 -0.0000012 0.0000105 0.0000015 0.1777972 0.0388941 -0.0385003 0.000003 0.0686235 0.3904143 -0.0000028 0.0000004 -0.0000055 0.3789301 0.0388958 0.0384762 -0.0000367 -0.0686473 0.3904119 -0.0000025 -0.0000346 0.0000335 0.3789299 unknown
polarizability: 212.2830314|0.0019093|155.807068|-0.0093958|-0.0031791|63.5109952 unknown
InChI: InChI=1S/C12H12O2/c1-7-5-9-10(6-8(7)2)12(14)4-3-11(9)13/h3-6,13-14H,1-2H3
charge 0 multiplicity 1
26 atoms
O  1.573093 2.827914 -0.000089
O  1.573284 -2.827817 0.000018
C  0.385121 0.721346 0.000004
C  0.38517 -0.721329 0.000039
C  -2.088092 0.723238 0.000091
C  -2.088043 -0.723387 0.000127
C  -0.867569 1.409466 0.000027
C  -0.867474 -1.409533 0.00009
C  1.643496 1.418098 -0.000054
C  1.643591 -1.417995 0.000008
C  -3.397968 1.48991 0.000229
C  -3.397867 -1.490148 0.000364
C  2.850072 0.714793 -0.000081
C  2.85012 -0.714609 -0.000056
H  -0.851797 2.503805 -0.000017
H  -0.851628 -2.503872 0.000091
H  -4.013106 1.246345 0.888287
H  -3.220493 2.578505 -0.000169
H  -4.0137 1.245787 -0.887254
H  -4.012656 -1.247096 0.888811
H  -4.013981 -1.245595 -0.88673
H  -3.220319 -2.578731 -0.000666
H  3.808907 1.248538 -0.00013
H  3.808991 -1.24829 -0.000091
H  2.481267 3.218973 -0.000098
H  2.481485 -3.218814 0.00015
