program: Gaussian 09
title: 000235457
version: EM64L-G09RevD.01
frameworkgroup: C1[X(C24H26N2)]
method: RPBEPBE
basis: SDD
operation: Freq
keyword: #pfreq=noraman
keyword: PBEPBE/SDD
title: #p freq=noraman PBEPBE/SDD
converged: NO YES NO NO
title: Mulliken charges:
elementType: N N C C C C C C C C C C C C C C C C C C C C C C C C H H H H H H H H H H H H H H H H H H H H H H H H H H
charge: -0.426209 -0.463420 -0.307241 0.322431 0.181261 -0.623987 0.279382 -0.453054 0.370901 0.208551 -0.786001 -0.757438 -0.742450 0.071852 -0.426906 -0.407496 0.118537 0.177246 -0.280232 -0.208194 0.209900 -0.812830 -0.364766 -0.375084 -0.278721 -0.221211 0.229082 0.233410 0.199136 0.231510 0.259494 0.203187 0.215036 0.242822 0.200404 0.245566 0.231775 0.205300 0.228299 0.240411 0.235581 0.224855 0.219745 0.217037 0.300303 0.222300 0.276009 0.235591 0.232092 0.226652 0.219075 0.220508
chargesum: 0.00000
title: Mulliken charges with hydrogens summed into heavy atoms:
elementType: N N C C C C C C C C C C C C C C C C C C C C C C C C
charge: -0.166714 -0.163117 -0.078159 0.322431 0.181261 -0.191441 0.279382 -0.221545 0.370901 0.208551 -0.124956 -0.079694 -0.068440 0.071852 -0.191325 -0.182641 0.118537 0.177246 -0.060487 0.008843 0.209900 -0.078931 -0.132675 -0.148432 -0.059645 -0.000703
polarizability: 3.94972815e+02 -1.87297970e+01 2.70046372e+02 6.23287412e+00 -1.42900415e+01 1.70281595e+02
1716.lowfreq: -14.8852 -5.4577 -0.0002 0.0006 0.0007 3.7621 27.6409 30.0268 56.5667
frequency: 26.8791 29.8865 56.5094 77.8581 90.9693 120.0542 127.5620 143.3617 161.9479 168.2921 180.6617 195.2797 209.6398 231.8350 244.9767 260.5756 278.4641 281.5090 288.1933 295.3305 315.1836 322.4369 343.4425 359.3169 388.7859 429.1393 432.1894 436.6300 444.2102 472.2819 485.2913 490.8274 510.0136 522.4592 533.5221 548.4762 560.5039 574.1689 578.6643 612.0647 623.0928 654.1316 662.1973 679.6248 718.9569 748.9403 749.1272 760.5719 773.2136 796.2387 833.4459 837.6407 845.7914 848.9318 855.3169 868.8153 874.8342 897.5785 907.8839 916.0893 926.9245 929.6663 935.7996 946.4983 961.7839 963.2494 969.0951 984.7775 1000.8193 1003.1003 1011.3560 1020.5170 1022.3615 1037.3330 1043.1627 1088.6148 1110.4813 1131.4550 1134.1672 1154.5091 1165.3555 1168.4212 1182.3355 1198.9754 1199.1478 1219.1263 1232.6971 1235.9045 1253.8583 1263.7638 1278.0830 1291.5848 1300.5701 1306.2351 1320.6953 1334.4518 1342.4142 1358.3317 1372.1559 1372.9815 1392.2745 1399.9097 1414.8164 1416.6171 1428.1111 1453.2694 1455.0593 1459.4150 1462.8003 1463.6063 1465.0377 1467.9026 1469.7356 1479.4188 1480.5119 1483.0037 1484.0923 1490.5587 1562.5041 1584.0143 1599.0537 1619.5315 1630.7581 1659.2752 2940.7661 2964.1383 2964.8511 2967.3906 2977.8272 2982.0192 3026.0762 3036.0774 3055.3837 3064.9827 3069.3542 3076.1955 3076.9334 3085.6627 3094.1913 3095.1614 3118.5251 3123.1558 3127.1335 3133.8054 3139.8070 3151.4164 3160.1508 3165.6405 3538.8684 3600.3005
redmass: 4.1183 4.8398 4.3522 3.7623 3.9947 3.4062 2.7216 3.1129 2.1119 2.2305 1.6050 1.6270 3.2076 2.0706 1.1152 1.0261 3.2418 2.7712 3.6337 3.4260 3.2350 2.9483 3.8946 2.6183 2.2892 2.8069 2.9309 3.1429 1.9356 2.8757 5.3163 3.4862 1.7932 1.7575 3.3616 4.0154 4.1085 3.2853 3.2471 5.9693 4.9556 5.0583 4.3131 4.7494 3.0229 1.4823 1.3393 4.1661 3.9926 4.0390 3.1281 2.6348 1.6820 1.4635 3.8771 2.0572 2.6355 2.2013 2.6093 2.8984 1.3928 1.3824 1.4603 2.2231 1.4707 1.6119 1.3012 2.0598 1.7519 1.5963 1.7807 2.1332 2.0419 2.6712 1.5115 2.2064 1.8644 1.8774 1.8828 1.6537 1.1133 1.2104 2.0178 2.5316 1.7932 1.9003 1.7704 1.6718 1.7565 2.3238 2.4359 1.7051 1.4914 3.2264 1.5694 1.8007 2.4913 2.0272 1.2587 1.2088 1.2168 1.6091 2.4402 3.1043 2.9890 1.0852 2.4197 1.3320 1.0668 1.0953 2.2547 1.0943 1.1020 1.2015 1.3258 2.5019 1.8500 1.0800 6.2640 6.1347 6.5552 7.3677 6.8943 7.8153 1.0659 1.0390 1.0366 1.0346 1.0634 1.0566 1.0940 1.0969 1.0985 1.0995 1.0983 1.0985 1.0999 1.0960 1.0985 1.0905 1.0848 1.0852 1.0891 1.0896 1.0944 1.0946 1.0998 1.0990 1.0776 1.0803
irintensity: 0.4645 0.3282 0.4471 0.8134 0.3265 0.3565 1.0456 1.9022 0.4102 0.7105 0.7994 0.5071 0.5453 1.0202 0.0578 0.0426 2.7557 1.3472 0.1508 2.1382 8.9386 0.3449 1.0780 9.1591 11.7663 19.3856 6.3072 7.4238 96.7751 30.7342 0.6894 7.5640 44.9602 32.6730 16.3637 3.6733 16.9687 2.4051 8.4542 1.3798 3.7058 3.4120 10.0678 7.0395 8.5164 81.3495 101.8075 2.7449 6.5849 3.5365 2.8306 2.7083 1.6343 1.7875 1.7788 15.4518 5.5804 21.0617 6.1957 0.5153 2.1367 2.2759 1.1633 8.7614 0.3782 2.0919 0.3064 6.2467 2.4416 1.2914 6.3236 14.4007 11.8154 17.2722 4.9194 30.5253 3.1796 25.6808 1.9088 19.3953 1.6289 3.3458 1.4278 3.3395 1.7400 13.8711 6.6083 2.6445 6.4511 82.4660 15.3185 12.0665 3.2836 34.1650 1.7834 52.2861 4.0010 106.1150 15.8939 25.2500 17.1520 2.5556 25.9615 4.1956 42.0580 8.4008 47.8750 9.8011 4.2774 1.4012 48.3275 0.5400 7.5617 6.0222 33.8439 86.0239 7.1303 15.6159 22.1929 1.3156 1.5778 101.5372 1.9666 25.9868 26.8897 56.6087 29.6103 26.8877 47.0856 9.4105 16.2615 22.5900 37.2629 22.2552 22.8782 11.3669 75.7520 21.9047 28.8896 10.8171 5.1784 1.0417 6.4528 12.9780 37.4586 42.0049 36.8009 24.7241 9.8306 54.1642
temp: 298.150 k
press: 1.00000 atm
elementType: 7 7 6 6 6 6 6 6 6 6 6 6 6 6 6 6 6 6 6 6 6 6 6 6 6 6 1 1 1 1 1 1 1 1 1 1 1 1 1 1 1 1 1 1 1 1 1 1 1 1 1 1
symmnumber: 1
zpe: 1142503.5 jmol-1
zpe.correction: 0.435157 hartree
zpe.thermalcorrener: 0.458248 hartree
zpe.thermalcorrenthalpy: 0.459192 hartree
zpe.thermalcorrgfe: 0.384406 hartree
zpe.sumelectzpe: -1037.819385 hartree
zpe.sumelectthermal: -1037.796293 hartree
zpe.sumelectthermalent: -1037.795349 hartree
zpe.sumelectthermalfe: -1037.870135 hartree
dipole: 1.8113 2.8398 -0.0301
dipole: 3.3684
quadrupole: -151.5545 -134.8196 -158.9404
quadrupole: 7.4731 -6.4015 -4.1349
quadrupole: -3.1163 13.6186 -10.5022 7.4731 -6.4015 -4.1349
hfenergy: -1038.2545413 hartree
pointgroup: C01 [X(C24H26N2)]
dipole: -0.723685 -0.3480233 1.0542484 debye
polarizability: 394.7339011|-6.2722047|186.0463524|19.395471|-39.1934991|254.5205291 unknown
InChI: InChI=1S/C24H26N2/c1-15-21(17-9-5-7-11-19(17)25-15)16-13-23(2,3)22-18-10-6-8-12-20(18)26-24(22,4)14-16/h5-12,14,22,25-26H,13H2,1-4H3
charge 0 multiplicity 1
52 atoms
N  2.480926 -0.090623 1.62218
N  -4.001866 -1.339578 1.384696
C  2.011178 0.7460 -0.58507
C  1.148901 -0.223726 -1.479611
C  1.52381 0.837655 0.916622
C  -0.346046 0.174525 -1.295571
C  3.474184 0.331562 -0.428362
C  0.086511 0.418325 1.150274
C  -0.805305 0.116426 0.160999
C  3.67364 -0.18245 0.887811
C  1.525336 -0.026204 -2.970578
C  1.356709 -1.714265 -1.103994
C  1.732464 2.287959 1.449008
C  -2.193641 -0.301735 0.443958
C  4.545298 0.363099 -1.334799
C  4.926049 -0.69712 1.29224
C  -3.389399 0.045322 -0.321612
C  -2.611472 -1.160442 1.479908
C  5.814984 -0.141677 -0.940878
C  5.991667 -0.672843 0.358448
C  -4.506853 -0.61789 0.297578
C  -1.827099 -1.886862 2.535342
C  -3.639035 0.874084 -1.448717
C  -5.830489 -0.491426 -0.174214
C  -4.957189 1.005978 -1.928622
C  -6.043337 0.328895 -1.301357
H  1.924275 1.751185 -1.044865
H  -0.977073 -0.491307 -1.914048
H  -0.487261 1.202317 -1.695973
H  -0.2446 0.429917 2.198297
H  2.491626 -0.101545 2.643966
H  1.428573 1.034023 -3.276541
H  0.858389 -0.627635 -3.61721
H  2.562054 -0.350886 -3.168018
H  0.720239 -2.356827 -1.741876
H  1.099795 -1.905991 -0.049049
H  2.40888 -2.01286 -1.258218
H  1.495954 2.348179 2.528675
H  1.070465 2.995984 0.918446
H  2.782034 2.603001 1.300687
H  4.414557 0.786328 -2.337476
H  5.07715 -1.097955 2.301082
H  6.656586 -0.114277 -1.641153
H  6.97239 -1.062718 0.656064
H  -4.548781 -1.937892 2.000572
H  -2.213903 -2.912457 2.688997
H  -0.768645 -1.95888 2.234973
H  -1.85847 -1.369542 3.514603
H  -2.821997 1.41172 -1.939807
H  -6.666359 -1.005195 0.314384
H  -5.155089 1.642511 -2.798331
H  -7.057516 0.451115 -1.697663
