program: Gaussian 09
title: 000235451
version: EM64L-G09RevD.01
frameworkgroup: C1[X(C8H11N5S)]
method: RPBEPBE
basis: SDD
operation: Freq
keyword: #p
keyword: freq=noraman
keyword: PBEPBE/SDD
title: #p freq=noraman PBEPBE/SDD
converged: YES YES NO NO
title: Mulliken charges:
elementType: S N N N N N C C C C C C C C H H H H H H H H H H H
charge: 0.259735 -0.176333 -0.071725 -0.071322 -0.047929 -0.592682 0.176659 -0.350249 0.107940 -0.245456 -0.347895 -0.658038 -0.040382 -0.832372 0.217288 0.250856 0.265371 0.246152 0.220995 0.222521 0.325806 0.334096 0.283497 0.282552 0.240913
chargesum: 0.00000
title: Mulliken charges with hydrogens summed into heavy atoms:
elementType: S N N N N N C C C C C C C C
charge: 0.259735 -0.176333 -0.071725 -0.071322 -0.047929 0.067220 0.176659 0.117895 0.107940 0.019915 -0.347895 0.031631 -0.040382 -0.025410
polarizability: 1.87363071e+02 2.83185376e+00 1.75716028e+02 -6.17991503e+00 2.07905902e+00 7.04433898e+01
1716.lowfreq: -6.2870 -2.9769 -0.0024 -0.0008 0.0005 8.5524 31.9892 38.4286 62.4399
frequency: 31.1504 38.4224 62.4312 127.3133 138.1296 155.3799 171.5048 186.1828 226.7290 248.0899 257.0570 317.6482 337.2965 395.9779 414.1484 439.2930 498.7608 515.9184 533.3462 596.0133 627.9546 644.2020 657.3370 679.6970 713.1047 781.5456 788.1436 791.3826 812.2815 884.2863 945.1296 965.6145 973.8806 1008.8394 1037.9264 1068.1448 1089.0893 1122.9631 1194.7349 1223.0457 1276.1844 1309.4588 1323.5993 1338.9138 1354.0633 1362.9216 1377.9199 1393.7144 1436.5575 1438.8927 1446.0334 1467.1518 1471.0218 1484.7011 1502.0439 1506.7833 1572.9729 1605.2772 2991.3372 3015.4253 3028.3343 3072.2808 3091.1613 3104.2097 3149.5061 3170.8842 3225.3341 3565.8237 3725.4217
redmass: 2.5035 3.3381 4.5558 3.3896 1.3473 2.5848 3.5404 2.1470 6.6792 1.8111 2.6411 5.0099 4.7253 4.9851 4.9096 1.2214 5.7139 1.0734 4.6331 7.6737 4.8506 4.7022 7.1317 4.8173 11.5256 3.9930 1.4967 3.7765 1.8207 8.4426 3.6931 2.2476 1.1828 1.4677 2.2703 1.9824 2.0698 4.0670 2.2120 2.0241 2.9861 3.9485 3.3856 2.0227 1.1976 1.5305 5.4074 1.2383 2.0548 1.0825 1.2548 1.1653 1.1240 1.0673 2.7922 7.4420 9.4655 1.5553 1.0356 1.0609 1.0297 1.1026 1.0995 1.1027 1.1027 1.1056 1.0980 1.0440 1.1060
irintensity: 0.0348 3.5407 0.3917 1.0006 2.6897 3.1534 3.8893 0.8160 0.6236 2.9045 1.4398 5.0216 5.6893 1.2248 2.7343 305.7873 3.7822 3.8883 2.4917 0.3232 1.0139 17.5696 1.1289 4.7430 5.7956 22.9280 6.3885 5.3714 7.8301 102.6567 17.1396 1.1114 7.1207 4.0504 5.8948 0.3825 8.2192 56.3984 44.9909 30.5873 14.1084 97.8616 3.1281 31.1474 13.2299 6.5934 59.7164 15.4988 33.3567 18.8593 39.1026 4.5253 43.1707 6.1751 222.5613 244.4849 280.7619 467.5690 23.0260 36.8664 21.4664 1.2720 40.3327 26.2416 11.6126 9.2131 0.1039 129.4697 46.3478
temp: 298.150 k
press: 1.00000 atm
elementType: 16 7 7 7 7 7 6 6 6 6 6 6 6 6 1 1 1 1 1 1 1 1 1 1 1
symmnumber: 1
zpe: 505470.2 jmol-1
zpe.correction: 0.192523 hartree
zpe.thermalcorrener: 0.206467 hartree
zpe.thermalcorrenthalpy: 0.207412 hartree
zpe.thermalcorrgfe: 0.150666 hartree
zpe.sumelectzpe: -982.253910 hartree
zpe.sumelectthermal: -982.239966 hartree
zpe.sumelectthermalent: -982.239022 hartree
zpe.sumelectthermalfe: -982.295767 hartree
dipole: 4.1413 -0.2813 -0.2179
dipole: 4.1566
quadrupole: -80.6759 -75.5910 -92.2672
quadrupole: 0.6290 -0.8394 0.3826
quadrupole: 2.1688 7.2537 -9.4225 0.6290 -0.8394 0.3826
hfenergy: -982.4464335 hartree
pointgroup: C01 [X(C8H11N5S1)]
dipole: -1.6327924 -0.0451457 -0.0791599 debye
dipolederiv: -0.5805724 -0.4565564 -0.1414825 -0.2625497 -0.0947199 -0.0243894 -0.1087868 -0.0465335 -0.1052142 -0.8608378 0.1383067 0.0696191 -0.2222737 -0.4294486 -0.0438764 -0.0977822 -0.0211414 -0.2045041 -0.5231563 -0.0937435 -0.0075372 -0.1050828 -0.2782965 -0.0265417 -0.0561688 -0.0177044 -0.2172338 -0.74045 0.371927 0.0637482 0.045137 -1.0432241 -0.2167886 -0.0184512 -0.1666233 -0.2828466 -0.6733616 -0.5766105 -0.1676653 -0.3249526 -1.3687874 -0.3048199 -0.1162022 -0.3216468 -0.3057136 -0.1909 0.0182888 0.0545759 0.1508906 -1.7127221 -0.2392117 0.0824831 -0.2344532 -0.7757232 0.7370846 -0.2655792 -0.0481767 -0.089175 0.7249364 0.1778817 0.0220243 0.1249753 0.1574965 0.8010357 -0.0234285 -0.0488049 0.1231613 0.1668324 -0.0639886 0.0557763 -0.0735058 0.2526765 -0.8956471 -0.0997758 -0.0814495 -0.1046152 -0.1485391 -0.0348269 -0.1096535 -0.0582495 0.0190854 0.3409328 0.2376519 0.0712865 0.5292228 0.2629943 0.0786348 0.1724783 0.0934995 -0.068367 1.5270763 0.4936417 0.2296931 0.3663712 0.9636142 0.2580706 0.2193864 0.266048 0.1074775 -0.0809261 0.0045429 0.0347284 -0.0288506 0.0462247 0.0480114 0.0339413 0.0603931 -0.0538324 0.7310885 0.0449678 0.0446862 -0.0898805 2.1809263 0.4918994 0.0249457 0.4805806 0.304722 -0.0138076 0.0641344 0.0114655 0.034357 0.1490243 0.0275259 0.0060204 0.0323735 0.0415118 -0.0518095 0.0308774 -0.018911 0.1021872 -0.0675686 0.1220604 -0.0144054 0.0701924 0.0344199 0.0437153 0.0053731 0.0429492 -0.0900407 0.0248536 -0.0950032 0.0006557 -0.0569079 -0.0109723 0.0253073 0.0729823 0.0000675 0.052982 0.0538922 -0.025135 -0.0063882 -0.0228364 0.1686228 0.0809069 0.0933659 -0.0455821 0.0710646 -0.0346907 0.0791277 -0.0300472 0.0471655 0.0426725 -0.2069032 -0.0512388 -0.0155928 -0.0791053 0.1008601 -0.0009135 -0.0155202 -0.0098697 0.0733404 0.1137723 -0.0406268 -0.012015 0.0013467 -0.0478851 -0.1281912 0.0134343 -0.0763733 -0.0290867 0.1457074 0.0635825 -0.0055541 0.0162156 0.2680533 -0.0251184 -0.0176207 -0.0217861 0.3810069 0.1872464 -0.0728138 -0.0361589 -0.0231271 0.2848126 -0.0264276 -0.0232869 -0.03084 0.3799612 0.0836396 0.0525039 0.1085482 -0.0083826 -0.0032221 -0.0356866 0.084718 -0.0146582 -0.0126383 0.1100219 0.0855037 -0.0593435 0.0153436 -0.030799 0.036251 -0.0618809 0.0283297 -0.015958 -0.1091634 -0.0972768 -0.0430943 -0.0802439 0.0328787 -0.0285446 -0.0396694 -0.0304282 0.1190968 unknown
polarizability: 186.7716375|2.6509697|170.773683|5.7619134|23.9175712|75.9771682 unknown
InChI: InChI=1S/C8H11N5S/c1-3-13-4-10-5-6(13)11-8(9)12-7(5)14-2/h4H,3,9H2,1-2H3
charge 0 multiplicity 1
25 atoms
S  3.512888 0.271767 0.49345
N  -1.627852 0.486876 0.075438
N  0.268328 1.701836 0.537819
N  -0.629738 -1.723632 -0.344702
N  1.820785 -1.687715 -0.121277
N  0.679108 -3.646218 -0.688462
C  -0.561599 -0.407234 -0.029567
C  -3.052798 0.146226 -0.088633
C  0.618972 0.360487 0.255651
C  -1.067714 1.729692 0.422864
C  1.840917 -0.366229 0.192412
C  -3.718472 -0.269103 1.239131
C  0.615516 -2.306976 -0.374867
C  3.259574 2.100354 0.879612
H  -3.565578 1.020056 -0.529926
H  -3.103492 -0.6830 -0.815387
H  -1.684491 2.614501 0.568784
H  -3.21756 -1.156664 1.661845
H  -4.780656 -0.520301 1.066951
H  -3.672221 0.545916 1.982956
H  -0.178119 -4.153979 -0.885632
H  1.587585 -4.099877 -0.717481
H  2.628432 2.222622 1.768711
H  2.793615 2.611944 0.027954
H  4.276671 2.483152 1.061153
