program: Gaussian 09
title: 000235446
version: EM64L-G09RevD.01
frameworkgroup: C1[X(C5H7ClN4)]
method: RPBEPBE
basis: SDD
operation: Freq
keyword: #p
keyword: freq=noraman
keyword: PBEPBE/SDD
title: #p freq=noraman PBEPBE/SDD
converged: YES YES NO NO
title: Mulliken charges:
elementType: Cl N N N N C C C C C H H H H H H H
charge: -0.050390 -0.383820 -0.110353 -0.027886 -0.586986 0.294124 -0.312662 -0.025659 -0.118475 -0.605179 0.247792 0.310906 0.248057 0.206681 0.248813 0.335882 0.329156
chargesum: 0.00000
title: Mulliken charges with hydrogens summed into heavy atoms:
elementType: Cl N N N N C C C C C
charge: -0.050390 -0.072915 -0.110353 -0.027886 0.078052 0.294124 -0.064870 -0.025659 -0.118475 0.098371
polarizability: 1.30636028e+02 1.04904594e+00 1.13048952e+02 -2.89241110e-02 -3.96603058e-03 4.16846337e+01
1716.lowfreq: -6.4475 0.0007 0.0021 0.0024 7.1415 8.6675 72.8539 93.8986 172.4760
frequency: 72.8463 93.8964 172.4752 178.3846 193.7604 222.6420 234.0713 334.8182 405.5496 436.7771 466.1460 482.2542 531.7939 578.2082 602.8490 627.2884 669.0264 763.2026 802.1608 822.1564 902.3971 966.4033 1031.0069 1118.2114 1123.8793 1149.8680 1168.6063 1274.3515 1340.8044 1413.0312 1428.0898 1454.7126 1460.4139 1484.1048 1496.2319 1561.0656 1580.5665 1612.5924 2987.3035 3066.9130 3104.3912 3190.9374 3562.7743 3596.2241 3722.4119
redmass: 1.0951 3.0866 3.8164 7.2093 5.0923 4.1944 5.0363 6.0781 5.1440 1.1587 1.2066 4.4481 1.0672 6.4693 7.4248 4.2952 3.6522 4.0923 2.0363 6.9235 7.6857 2.8668 1.9949 2.8660 1.2801 1.9286 1.9332 3.0613 3.5903 1.9627 1.7586 1.0414 2.4008 2.3943 1.1384 2.5032 7.7553 1.8090 1.0339 1.1013 1.1012 1.0941 1.0442 1.0780 1.1060
irintensity: 0.4605 0.7179 0.6072 3.0067 17.7099 1.3874 0.6530 18.4263 3.8837 95.5771 317.0278 0.2268 0.5513 7.3678 9.1229 2.1403 8.2501 1.7941 69.7641 67.0589 10.0148 43.1753 9.7752 17.7558 1.8874 54.5732 4.5545 38.8641 3.4035 35.1894 110.7304 12.8165 101.4538 126.5652 43.3387 249.8850 813.0325 408.4013 63.9535 31.4881 25.9635 0.8570 112.8389 49.9160 48.6371
temp: 298.150 k
press: 1.00000 atm
elementType: 17 7 7 7 7 6 6 6 6 6 1 1 1 1 1 1 1
symmnumber: 1
zpe: 331889.5 jmol-1
zpe.correction: 0.126410 hartree
zpe.thermalcorrener: 0.136354 hartree
zpe.thermalcorrenthalpy: 0.137298 hartree
zpe.thermalcorrgfe: 0.090703 hartree
zpe.sumelectzpe: -873.072858 hartree
zpe.sumelectthermal: -873.062914 hartree
zpe.sumelectthermalent: -873.061970 hartree
zpe.sumelectthermalfe: -873.108565 hartree
dipole: -4.6122 -0.5553 0.0012
dipole: 4.6455
quadrupole: -65.3595 -47.9251 -68.5288
quadrupole: 3.9356 -0.0006 -0.0115
quadrupole: -4.7551 12.6794 -7.9243 3.9356 -0.0006 -0.0115
hfenergy: -873.1992682 hartree
pointgroup: C01 [X(C5H7Cl1N4)]
dipole: -1.8126632 0.2337702 -0.0045202 debye
dipolederiv: -0.7339545 0.4273123 0.0010596 0.4123204 -0.4464923 -0.001167 0.0008253 -0.001026 -0.1077585 -1.4904659 -0.196553 -0.0043386 -0.3893996 -0.3664252 -0.0017881 -0.0110115 -0.0016215 -0.5082014 -0.8768179 -0.4585366 -0.0059648 -0.4639328 -1.040897 -0.0080087 -0.0058176 -0.0079847 -0.253896 -0.6901245 0.378441 0.0012815 0.0736755 -1.5734657 -0.0106592 -0.0013805 -0.0094262 -0.2018027 -0.2219469 -0.1333528 0.0008298 -0.2290445 -1.5838084 -0.0076235 -0.000011 -0.0075401 -0.7296357 1.8201666 0.3740411 0.0088763 0.3481013 0.8655569 0.0068275 0.0090507 0.0067335 0.2131622 -1.2142566 -0.0176998 -0.0037384 0.246286 -0.3889542 -0.000306 -0.0016923 -0.0011973 -0.2296528 0.8411177 0.0536056 0.0027752 0.2918026 2.1366893 0.0163589 0.0047931 0.015477 0.2071473 1.5235581 -0.3233535 0.0029981 -0.2702483 1.5200868 0.0107579 0.0037024 0.0105398 0.0435757 0.5411232 -0.0742523 -0.00106 -0.23045 0.2489915 0.0016484 0.0000667 0.0023765 0.2432522 0.0842429 -0.0372141 -0.00076 -0.0229193 -0.0472589 -0.0021763 -0.000697 -0.0022563 0.2095766 0.1311753 0.0649552 -0.0004071 0.1172815 0.1328634 -0.0007452 0.0009106 -0.0001957 0.3390795 0.0251051 -0.0023758 -0.0192676 0.1246399 0.020826 -0.0986146 0.0578601 -0.096442 -0.0697291 -0.111711 -0.0789032 -0.003051 -0.1680671 -0.0148535 -0.0039316 -0.0040814 -0.0033864 0.1242082 0.0293487 -0.0048896 0.0221779 0.1224355 0.015855 0.1013881 -0.0512159 0.0978021 -0.0622994 0.1911758 0.0735999 -0.0001584 0.0353971 0.2582804 -0.0009595 -0.0004461 -0.0007541 0.3946258 0.152264 -0.0448243 -0.0012525 0.0021216 0.2630058 -0.0010009 -0.0008557 -0.0010986 0.3883481 unknown
polarizability: 130.0742335|-3.2654421|113.6052406|0.2802895|0.5660122|41.6901397 unknown
InChI: InChI=1S/C5H7ClN4/c1-8-4-2-3(6)9-5(7)10-4/h2,8H,7H2,1H3
charge 0 multiplicity 1
17 atoms
Cl 2.962118 -1.776376 -0.014561
N  -2.2093 -1.012495 -0.028477
N  -0.792985 0.85717 -0.007659
N  1.643813 0.592365 -0.000709
N  0.64355 2.707143 0.012433
C  -0.928875 -0.505954 -0.019225
C  0.211695 -1.381172 -0.022021
C  0.486888 1.342327 0.00088
C  1.453071 -0.736569 -0.012147
C  -3.402991 -0.159263 -0.025775
H  0.118734 -2.468022 -0.031215
H  -2.320889 -2.024654 -0.034972
H  -3.433749 0.479912 0.874801
H  -4.298821 -0.802013 -0.044452
H  -3.416213 0.507573 -0.906263
H  1.583026 3.094526 0.018917
H  -0.180273 3.301601 0.014046
