program: Gaussian 09
title: 000235442
version: EM64L-G09RevD.01
frameworkgroup: C1[X(C12H18N2O4)]
method: RPBEPBE
basis: SDD
operation: Freq
keyword: #p
keyword: freq=noraman
keyword: PBEPBE/SDD
title: #p freq=noraman PBEPBE/SDD
converged: YES YES NO NO
title: Mulliken charges:
elementType: O O O O N N C C C C C C C C C C C C H H H H H H H H H H H H H H H H H H
charge: -0.281704 -0.311497 -0.288188 -0.258372 -0.410670 -0.627295 0.317313 -0.062416 0.222381 0.061080 -0.516555 -0.796756 0.156923 0.160667 -0.256551 -0.253236 -0.667666 -0.664248 0.364869 0.246670 0.261037 0.236272 0.269217 0.234869 0.287047 0.294471 0.232498 0.219453 0.235124 0.218781 0.213871 0.225266 0.249264 0.214549 0.221675 0.251856
chargesum: 0.00000
title: Mulliken charges with hydrogens summed into heavy atoms:
elementType: O O O O N N C C C C C C C C C C C C
charge: -0.281704 -0.311497 -0.288188 -0.258372 -0.045801 -0.045777 0.317313 -0.062416 0.222381 0.061080 -0.008849 -0.056398 0.156923 0.160667 0.195400 0.200668 0.020735 0.023832
polarizability: 2.42799602e+02 -6.52128820e-01 1.71784489e+02 5.25737454e-01 1.33700198e+00 9.93675005e+01
1716.lowfreq: -9.4998 -6.4376 -4.2490 -0.0009 0.0003 0.0005 30.2690 35.4138 38.6976
frequency: 30.1950 35.4022 38.6392 52.2656 68.5398 87.0956 89.7778 99.8081 110.6463 120.4392 123.4215 151.3088 184.4234 213.0736 215.4128 226.1866 259.7646 273.6472 299.3758 304.2917 322.5467 334.3734 348.1268 403.1542 427.6082 449.6619 472.3063 605.5902 613.9014 627.9390 639.7658 682.6296 711.0863 726.0346 727.7553 745.3672 793.8200 811.0263 817.9676 833.7366 835.4222 851.4465 896.4632 988.4314 994.0394 1016.7525 1031.5966 1044.2573 1062.5230 1081.6538 1094.9107 1095.3442 1136.8840 1146.8065 1153.1823 1154.5612 1201.5311 1245.9203 1278.6808 1279.2845 1287.8680 1336.6042 1343.8726 1353.3687 1373.1657 1386.6290 1387.3071 1401.0197 1422.5747 1444.4084 1452.7046 1456.3140 1457.9584 1461.7800 1462.4214 1472.3169 1483.3537 1484.2848 1488.5590 1515.7837 1554.6658 1599.4256 1635.9569 1647.5431 2984.7573 2990.5961 2990.6624 2993.0283 3026.3044 3026.5276 3033.8860 3067.1242 3084.9731 3085.2585 3089.4684 3089.8000 3115.1108 3115.8371 3117.4252 3489.6623 3528.4074 3614.2890
redmass: 3.5562 2.9937 2.9633 2.7067 3.3558 5.8188 4.0968 3.4518 3.7339 1.1084 2.9164 3.0310 2.5812 1.3359 1.2341 1.4158 3.8612 3.5360 3.6813 2.8207 3.5562 4.1980 5.5315 4.4813 3.4285 5.6516 4.1804 4.1812 3.9122 3.6392 2.3337 3.5202 3.1972 3.3647 8.3576 6.8892 1.9093 1.3291 1.9295 2.0130 1.4292 2.8130 1.4911 2.5934 3.3619 2.9601 3.8501 1.5018 5.4655 2.9181 2.1630 2.1420 1.5718 1.4940 1.6935 1.7683 2.4156 4.0018 1.1135 1.1168 1.3140 2.0580 1.4099 1.3094 2.2845 1.2416 1.2344 1.2515 4.6319 1.2341 1.1937 1.1448 1.1302 1.0430 1.0456 1.0472 1.2471 1.0524 2.7301 4.3200 5.6291 9.3361 9.2306 1.1028 1.0623 1.0360 1.0360 1.0375 1.0588 1.0590 1.0999 1.0959 1.0985 1.0975 1.1028 1.1033 1.1054 1.1055 1.1002 1.0463 1.0798 1.0981
irintensity: 1.5166 2.6154 0.2421 2.1565 0.9447 0.8996 0.0997 0.6394 5.4433 0.1695 2.3524 1.7186 1.5194 7.5334 16.0032 3.0163 2.0049 11.9687 10.2266 6.6474 11.3166 0.4360 13.6344 6.3570 2.7161 9.7124 4.3277 7.4284 19.6398 36.0309 91.0070 27.8225 38.7686 8.9170 2.0203 7.6249 12.6046 0.7907 4.4847 28.7239 46.7665 15.8732 16.0704 79.4881 50.8747 85.0692 526.1368 2.8743 178.1678 35.8565 26.3703 10.5792 52.5412 18.1895 75.6497 27.7440 330.7922 93.2308 2.7798 4.4531 31.3343 62.2753 13.0633 0.1128 19.1810 23.2681 30.1891 43.1380 72.8735 11.8601 78.6935 14.2806 40.7564 15.3650 16.5056 14.3618 9.2584 21.9616 37.2932 11.1844 208.4389 386.3211 249.1534 57.7137 16.8613 27.0729 23.5868 17.0661 44.5340 35.4188 10.6162 13.9630 43.7877 36.4237 7.5168 2.3588 32.6179 32.7702 2.9832 4.1013 154.4078 7.1751
temp: 298.150 k
press: 1.00000 atm
elementType: 8 8 8 8 7 7 6 6 6 6 6 6 6 6 6 6 6 6 1 1 1 1 1 1 1 1 1 1 1 1 1 1 1 1 1 1
symmnumber: 1
zpe: 765734.5 jmol-1
zpe.correction: 0.291653 hartree
zpe.thermalcorrener: 0.312065 hartree
zpe.thermalcorrenthalpy: 0.313010 hartree
zpe.thermalcorrgfe: 0.240828 hartree
zpe.sumelectzpe: -877.123189 hartree
zpe.sumelectthermal: -877.102777 hartree
zpe.sumelectthermalent: -877.101832 hartree
zpe.sumelectthermalfe: -877.174014 hartree
dipole: 0.5565 3.3963 0.8928
dipole: 3.5555
quadrupole: -92.5323 -96.9159 -104.7923
quadrupole: 13.5802 0.9585 0.5053
quadrupole: 5.5478 1.1643 -6.7121 13.5802 0.9585 0.5053
hfenergy: -877.414842 hartree
pointgroup: C01 [X(C12H18N2O4)]
dipole: -0.1432909 1.3541837 -0.3199952 debye
polarizability: 242.6458334|-3.3821237|171.9634408|0.15164|0.3090947|99.3423173 unknown
InChI: InChI=1S/C12H18N2O4/c1-4-17-11(15)9-7(3)10(12(16)18-5-2)14-8(9)6-13/h14H,4-6,13H2,1-3H3
charge 0 multiplicity 1
36 atoms
O  2.972993 -1.310552 0.413396
O  -3.493689 0.29784 0.445654
O  3.306021 1.00436 0.394156
O  -2.920777 -1.981228 0.484379
N  -0.95105 1.131675 0.401745
N  -0.216435 3.74383 0.122222
C  0.389458 1.374268 0.383751
C  1.054922 0.113634 0.406158
C  0.042684 -0.922479 0.43818
C  -1.203843 -0.252731 0.434227
C  0.899707 2.798178 0.357492
C  0.241412 -2.413511 0.47054
C  2.514503 0.016448 0.401168
C  -2.563933 -0.773918 0.454689
C  4.45471 -1.492572 0.394611
C  -4.933562 -0.086592 0.437722
C  4.987213 -1.486385 -1.04159
C  -5.43213 -0.305385 -0.994269
H  -1.641103 1.888784 0.389603
H  1.378883 3.023304 1.329046
H  1.718718 2.871283 -0.384513
H  0.84462 -2.708102 1.347782
H  -0.728982 -2.931954 0.502238
H  0.80937 -2.752053 -0.414566
H  -0.357055 3.996885 -0.859454
H  -0.217894 4.562313 0.733585
H  4.917674 -0.689747 0.994894
H  4.602003 -2.468921 0.884442
H  -5.056382 -1.000432 1.045273
H  -5.436575 0.764399 0.925559
H  6.069747 -1.713849 -1.041098
H  4.474603 -2.248008 -1.654518
H  4.84304 -0.496554 -1.50609
H  -6.518892 -0.511386 -0.985679
H  -5.254831 0.589817 -1.615437
H  -4.922046 -1.167464 -1.455796
