program: Gaussian 09
title: 000235424
version: EM64L-G09RevD.01
frameworkgroup: C1[X(C13H19N3O2)]
method: RPBEPBE
basis: SDD
operation: Freq
keyword: #p
keyword: freq=noraman
keyword: PBEPBE/SDD
title: #p freq=noraman PBEPBE/SDD
converged: YES YES NO NO
title: Mulliken charges:
elementType: O O N N N C C C C C C C C C C C C C H H H H H H H H H H H H H H H H H H H
charge: -0.319554 -0.331977 -0.065940 -0.179886 -0.493308 -0.347942 -0.368453 -0.388372 -0.362194 -0.613899 0.276161 0.307560 0.169948 -0.316842 -0.325555 -0.234796 -0.257065 -0.527897 0.187546 0.213308 0.214789 0.197827 0.227212 0.196778 0.260657 0.217067 0.190676 0.226280 0.222372 0.342028 0.311749 0.235572 0.223668 0.222371 0.226685 0.225526 0.237900
chargesum: 0.00000
title: Mulliken charges with hydrogens summed into heavy atoms:
elementType: O O N N N C C C C C C C C C C C C C
charge: -0.319554 -0.331977 -0.065940 -0.179886 -0.151280 0.052913 0.044163 0.035618 0.115530 0.025428 0.276161 0.307560 0.169948 -0.005092 -0.089983 -0.011128 -0.034693 0.162214
polarizability: 2.47307599e+02 -6.45919272e+00 1.79587596e+02 1.18282921e+01 -5.28531805e+00 1.01646980e+02
1716.lowfreq: -17.4506 -4.2789 -1.6886 -0.0007 0.0005 0.0008 13.3095 17.9135 60.1757
frequency: -7.7751 17.2655 60.1176 78.5160 85.2469 102.1117 156.6843 167.0101 182.1831 216.3935 220.7398 238.0633 246.9181 291.0829 298.4364 311.5876 328.3454 351.9729 394.2056 430.4763 451.6067 469.3955 481.0030 552.1687 556.4682 560.4089 591.5839 637.8306 641.2665 697.7547 730.9037 743.7414 748.8431 749.3667 826.5912 836.3646 850.7105 852.0082 930.2871 931.6758 982.0196 983.8436 997.0466 1002.3062 1040.0542 1047.1618 1064.0393 1068.6899 1088.4751 1108.6649 1117.3924 1128.0963 1147.6715 1150.7456 1165.9527 1171.3389 1193.0464 1201.9315 1223.6483 1244.6151 1255.6345 1287.3571 1291.4362 1307.3766 1339.4150 1350.6993 1364.7492 1369.2450 1383.0821 1407.9487 1429.9575 1430.8920 1448.9963 1451.7501 1453.7053 1460.8078 1462.1844 1465.1355 1471.6443 1474.4900 1481.4474 1487.9775 1522.1556 1596.1702 1603.9427 1617.4850 2841.9410 2857.0323 2871.2233 2964.1477 2967.8818 2973.4956 3020.1918 3026.0730 3036.8679 3053.1605 3073.6162 3077.9539 3096.0509 3122.1708 3133.4444 3150.6593 3167.7315 3194.2188 3529.9062
redmass: 3.1532 4.2677 4.5789 4.1966 3.9012 5.0066 3.1115 2.9894 2.5584 3.0646 1.7875 1.3464 1.8237 2.6299 2.8868 3.1408 2.6282 4.5396 2.0347 4.3608 3.2165 2.6996 5.5968 5.0529 3.4922 3.3766 4.5550 1.3234 2.5572 9.2025 4.2799 4.8128 1.3551 3.2521 4.7192 1.7030 1.3751 5.0360 1.3450 2.0812 1.2927 3.0111 7.8317 2.6756 2.0692 1.6918 1.9911 1.8843 1.9019 1.8526 1.2581 1.7670 2.5617 1.4312 2.6052 1.0831 1.9520 1.1802 2.0812 2.8044 1.9098 1.5261 1.4801 1.7348 1.2814 1.3457 1.3701 1.6723 1.9218 3.7509 1.4214 1.2528 1.5548 1.2064 1.0810 1.1123 1.0871 1.0504 1.3142 1.1043 1.0530 1.6231 2.7351 7.4328 5.1014 5.4166 1.0698 1.0642 1.0618 1.0324 1.0669 1.0679 1.0738 1.0886 1.0903 1.1042 1.0945 1.1009 1.0942 1.1000 1.0855 1.0913 1.0977 1.0950 1.0748
irintensity: 0.0701 0.2236 2.1487 1.5370 0.6825 8.7486 3.6977 2.5341 2.9366 1.0092 0.2164 0.8547 0.6886 3.7428 6.3820 7.3957 2.7691 11.1343 2.7284 4.2869 9.9998 0.1551 0.5893 15.1502 6.0239 9.7575 4.6721 43.9285 2.1043 19.1171 7.8824 3.5236 119.2525 7.4334 1.2408 0.6850 1.7129 1.4193 7.3401 0.5463 3.4700 54.2792 67.3158 45.8602 21.9970 2.7371 6.3458 15.7351 21.0481 35.0494 0.2803 22.7686 43.2858 1.1362 8.8431 5.0816 51.4943 26.6054 144.5691 179.9172 55.2364 65.0266 15.7800 96.3905 16.5684 7.9272 2.6303 5.2953 22.0740 136.2972 66.2472 34.7715 55.3895 30.5129 0.3053 23.8631 33.7650 15.0785 83.4118 14.5799 9.1956 35.5940 799.7737 128.7086 23.3610 198.1416 58.7215 45.9456 194.4056 69.1364 33.9461 74.8170 46.1753 54.9879 58.4528 44.3692 35.6600 33.9360 6.2729 21.7831 1.4015 24.7792 21.3193 8.7190 35.9955
temp: 298.150 k
press: 1.00000 atm
elementType: 8 8 7 7 7 6 6 6 6 6 6 6 6 6 6 6 6 6 1 1 1 1 1 1 1 1 1 1 1 1 1 1 1 1 1 1 1
symmnumber: 1
zpe: 810574.8 jmol-1
zpe.correction: 0.308732 hartree
zpe.thermalcorrener: 0.325354 hartree
zpe.thermalcorrenthalpy: 0.326298 hartree
zpe.thermalcorrgfe: 0.263998 hartree
zpe.sumelectzpe: -820.105757 hartree
zpe.sumelectthermal: -820.089135 hartree
zpe.sumelectthermalent: -820.088190 hartree
zpe.sumelectthermalfe: -820.150491 hartree
dipole: -0.6756 5.2335 0.5321
dipole: 5.3037
quadrupole: -89.3267 -101.7023 -111.2708
quadrupole: 7.6783 -2.2939 -1.1969
quadrupole: 11.4399 -0.9357 -10.5042 7.6783 -2.2939 -1.1969
hfenergy: -820.4144887 hartree
pointgroup: C01 [X(C13H19N3O2)]
dipole: 0.234789 1.8843076 -0.8650297 debye
polarizability: 247.7876829|9.179716|174.8353425|4.0075794|-19.7273351|105.9191495 unknown
InChI: InChI=1S/C13H19N3O2/c1-15-7-9-16(10-8-15)13(17)14-11-5-3-4-6-12(11)18-2/h3-6,14H,7-10H2,1-2H3
charge 0 multiplicity 1
37 atoms
O  0.516732 -2.163601 1.041223
O  -2.119768 1.794922 -0.226027
N  4.509127 0.341293 -0.328248
N  1.887746 -0.308725 0.670173
N  -0.461876 -0.119272 0.415074
C  3.31385 1.050219 -0.836256
C  4.16976 -1.0544 0.047467
C  2.195198 1.064929 0.230497
C  3.073634 -1.062522 1.127075
C  5.646237 0.415278 -1.265789
C  0.633838 -0.935827 0.724454
C  -1.817106 -0.511028 0.306618
C  -2.733563 0.53044 -0.046301
C  -2.31878 -1.818273 0.512335
C  -4.109374 0.274689 -0.191261
C  -3.702476 -2.072937 0.363926
C  -4.596876 -1.039609 0.015525
C  -2.98104 2.92254 -0.577724
H  2.91304 0.574188 -1.76943
H  3.594586 2.092667 -1.078858
H  5.07762 -1.543741 0.446414
H  3.817905 -1.645129 -0.836639
H  2.536971 1.66673 1.097804
H  1.313047 1.560374 -0.207378
H  2.747813 -2.089497 1.355308
H  3.47272 -0.592673 2.049258
H  5.442326 -0.076555 -2.25045
H  6.528363 -0.074435 -0.816044
H  5.903744 1.47253 -1.457939
H  -0.324443 0.880609 0.256452
H  -1.616531 -2.60675 0.787852
H  -4.801969 1.07735 -0.46221
H  -4.076463 -3.089554 0.526102
H  -5.667064 -1.243413 -0.095932
H  -3.73673 3.107566 0.20976
H  -3.488523 2.749265 -1.54628
H  -2.309976 3.790552 -0.65995
