program: Gaussian 09
title: 000020594
version: EM64L-G09RevD.01
frameworkgroup: C1[X(C6H6O3)]
method: RPBEPBE
basis: SDD
operation: Freq
keyword: #p
keyword: freq=noraman
keyword: PBEPBE/SDD
title: #p freq=noraman PBEPBE/SDD
converged: YES YES NO NO
title: Mulliken charges:
elementType: O O O C C C C C C H H H H H H
charge: -0.161326 -0.119351 -0.117715 -0.256263 -0.590124 0.163612 0.087119 0.093286 -0.678798 0.280760 0.295715 0.285244 0.246063 0.241932 0.229848
chargesum: 0.00000
title: Mulliken charges with hydrogens summed into heavy atoms:
elementType: O O O C C C C C C
charge: -0.161326 -0.119351 -0.117715 0.024497 -0.009165 0.163612 0.087119 0.093286 0.039044
polarizability: 8.24119519e+01 2.80759468e+00 7.49981433e+01 -4.53922258e-01 9.94984026e-02 4.47675199e+01
1716.lowfreq: -15.9561 -0.0007 -0.0006 -0.0004 1.2176 8.4964 49.9150 65.9820 124.4322
frequency: 49.9074 65.9532 124.4246 218.4513 235.3851 306.8316 352.9372 400.0738 470.4810 497.3916 557.0844 614.1923 647.0640 728.5639 782.7951 852.5250 950.3647 975.4305 1009.1036 1083.3407 1114.7670 1144.7494 1180.5322 1186.8708 1226.0935 1257.7759 1384.6603 1392.1795 1467.8063 1475.2134 1625.3754 1680.8474 1690.1903 2917.0176 2989.7001 3008.0387 3072.9624 3107.8842 3116.8828
redmass: 5.8588 3.5848 1.0281 3.1296 3.9123 13.6934 5.0562 6.0133 3.2642 3.9972 8.3997 3.7626 5.0808 3.1390 2.3686 2.0734 3.4943 1.3170 3.9849 1.5999 1.9529 3.2664 1.9085 1.7531 1.5320 3.0567 1.0692 1.1832 1.0456 1.0506 11.7532 12.5578 12.1484 1.0783 1.0660 1.0352 1.0938 1.1005 1.1013
irintensity: 0.6082 17.4232 0.4247 1.1055 4.7237 6.7003 9.0768 5.6245 1.2148 7.0762 6.8012 0.3678 8.7456 4.0209 0.8700 18.3285 42.2183 2.7859 4.6425 17.8650 44.8009 46.5833 36.7747 16.9451 10.9557 69.1960 43.2517 16.9101 18.9106 6.2488 393.7558 27.4512 25.3890 9.9500 3.2855 14.5094 0.1159 17.6349 7.9349
temp: 298.150 k
press: 1.00000 atm
elementType: 8 8 8 6 6 6 6 6 6 1 1 1 1 1 1
symmnumber: 1
zpe: 280894.2 jmol-1
zpe.correction: 0.106987 hartree
zpe.thermalcorrener: 0.115750 hartree
zpe.thermalcorrenthalpy: 0.116694 hartree
zpe.thermalcorrgfe: 0.072575 hartree
zpe.sumelectzpe: -457.215453 hartree
zpe.sumelectthermal: -457.206690 hartree
zpe.sumelectthermalent: -457.205746 hartree
zpe.sumelectthermalfe: -457.249865 hartree
dipole: -1.7188 -0.9508 1.6955
dipole: 2.5949
quadrupole: -66.2211 -56.0479 -47.4357
quadrupole: -9.1144 -0.2547 -0.5693
quadrupole: -9.6529 0.5203 9.1326 -9.1144 -0.2547 -0.5693
hfenergy: -457.3224403 hartree
pointgroup: C01 [X(C6H6O3)]
dipole: 0.8040832 0.142137 0.61276 debye
dipolederiv: -0.9306264 -0.1347907 0.1452087 -0.1271207 -0.5271469 0.0431434 0.2905663 0.0954112 -0.3488699 -0.6736396 -0.1713777 -0.0186673 -0.2749302 -0.649575 -0.0194919 -0.092167 -0.0733825 -0.2713011 -0.8587366 0.1108336 -0.0024598 0.1780822 -0.4722392 0.000619 -0.0148301 0.0176889 -0.2796321 -0.5747434 -0.0803992 -0.0180421 -0.0622598 -0.4522814 0.1057449 -0.0754292 0.1126362 0.0639049 -0.5676882 0.0079183 0.0380197 -0.0287137 -0.5177322 -0.0795121 0.041541 -0.0208631 0.0380877 1.0759386 0.0504052 -0.2695314 0.0698973 1.0084803 -0.1270984 -0.3881189 -0.2136186 0.2096799 1.1190329 0.1199457 0.1155968 0.1399347 0.5084802 0.0183863 0.2017296 0.0730974 0.195008 1.0586508 0.1446155 0.0248906 0.1373288 0.6167092 0.0120648 -0.0075567 -0.0038848 0.1896903 0.0133922 -0.0352575 0.0228912 -0.0597243 0.0391787 -0.02218 0.0049212 0.0076441 0.0689514 0.1319138 -0.0095667 0.0002881 -0.0131632 0.1287539 -0.0285451 0.0387325 -0.0460709 -0.0243977 0.0399056 0.0151778 0.0116186 0.0064019 0.0635805 0.0646671 0.0033025 0.0897119 0.0776567 0.1002371 -0.0050633 -0.0079903 0.0384094 0.166584 -0.0300419 0.001431 -0.0468127 0.0313909 -0.0988697 0.0429172 -0.0400243 -0.0068047 0.098551 -0.0193301 -0.0347881 -0.0224584 0.0844701 0.0866193 -0.0816949 0.0364552 -0.0277577 -0.0771241 0.0411787 0.034869 0.0440257 0.075102 0.0786134 0.0263369 -0.0382534 0.03042 0.065781 0.0403954 -0.0042034 -0.0131245 -0.1097409 unknown
polarizability: 83.1900573|0.3148643|74.0509282|-2.4881773|0.6215331|44.9366296 unknown
InChI: InChI=1S/C6H6O3/c1-3-4(7)2-5(8)6(3)9/h3H,2H2,1H3
charge 0 multiplicity 1
15 atoms
O  2.359382 0.919379 -0.540375
O  -1.585728 -1.668477 -0.17155
O  -2.399936 1.215997 -0.093307
C  0.712346 -0.776645 0.211759
C  0.054788 1.638957 0.016664
C  1.20819 0.639802 -0.140753
C  -0.806223 -0.709078 -0.006362
C  -1.22589 0.800726 -0.031456
C  1.443818 -1.94112 -0.47701
H  0.845452 -0.87256 1.316786
H  0.07987 2.432811 -0.750022
H  0.120671 2.153053 0.998029
H  2.519346 -1.909126 -0.238212
H  1.024211 -2.905138 -0.144729
H  1.335703 -1.87728 -1.573161
