program: Gaussian 09
title: 000235419
version: EM64L-G09RevD.01
frameworkgroup: C1[X(C18H18O4)]
method: RPBEPBE
basis: SDD
operation: Freq
keyword: #pfreq=noraman
keyword: PBEPBE/SDD
title: #p freq=noraman PBEPBE/SDD
converged: YES YES NO NO
title: Mulliken charges:
elementType: O O O O C C C C C C C C C C C C C C C C C C H H H H H H H H H H H H H H H H H H
charge: -0.437846 -0.455900 -0.439057 -0.211946 -0.150597 -0.257003 -0.414602 -0.316540 0.325185 0.324684 -0.456200 0.457340 0.162553 -0.403242 -0.376805 -0.400418 -0.431426 -0.249779 -0.252624 -0.244664 -0.235783 -0.243646 0.252902 0.269425 0.258741 0.202085 0.210533 0.294579 0.241884 0.252246 0.371979 0.258400 0.236240 0.226750 0.226125 0.343520 0.379852 0.226442 0.226651 0.229963
chargesum: 0.00000
title: Mulliken charges with hydrogens summed into heavy atoms:
elementType: O O O O C C C C C C C C C C C C C C C C C C
charge: -0.065867 -0.112380 -0.059205 -0.211946 0.102305 0.012422 -0.155860 -0.114454 0.325185 0.324684 0.048912 0.457340 0.162553 -0.161358 -0.124559 -0.142019 -0.195187 -0.023029 -0.026499 -0.018223 -0.009132 -0.013683
polarizability: 2.16315054e+02 1.44590045e+01 2.04547052e+02 -5.09963615e+00 -6.51399001e+00 1.69557929e+02
1716.lowfreq: -9.8061 -6.8769 -0.0008 -0.0005 -0.0004 12.1945 37.3668 47.1530 55.6589
frequency: 37.2924 47.0904 55.5862 60.4968 61.7889 75.4199 82.9863 115.3590 163.3674 176.3111 197.3062 225.2457 239.8526 264.2436 286.2149 295.6944 323.9759 338.8313 362.0486 397.3054 405.2232 455.1062 473.1430 478.6836 519.3400 550.8228 579.8670 582.7490 589.8829 613.8069 618.1728 638.9343 657.3000 679.2279 698.7834 709.2624 724.8841 760.6197 770.1840 799.1043 821.9735 847.3936 857.7748 878.7344 882.9142 909.5535 927.5703 937.5925 944.2229 957.0819 981.1712 989.1293 990.2645 997.8361 1005.6312 1027.1917 1028.7155 1038.7167 1058.5048 1062.9791 1081.2989 1107.7551 1121.4760 1162.7124 1172.0342 1174.8115 1183.5273 1188.3345 1190.2542 1205.3746 1217.8312 1225.7116 1241.5838 1260.4253 1267.7241 1277.3300 1313.4164 1323.2880 1331.9896 1338.3567 1345.9427 1367.1701 1378.2755 1380.6418 1386.8097 1389.3657 1436.5087 1444.8078 1480.5028 1480.9598 1490.1760 1589.3520 1594.7054 1610.4333 1617.6301 1660.3608 2942.0521 2966.1410 2986.6169 2992.5892 3002.3421 3107.6280 3117.8978 3123.0175 3128.7925 3133.3135 3135.0820 3142.4506 3145.3542 3161.1011 3162.3484 3485.4943 3510.4580 3565.5952
redmass: 4.9029 4.0362 7.0710 4.6892 6.6194 5.3847 4.2074 4.2724 6.2657 4.6034 4.4722 5.3135 4.4677 5.0288 4.4484 5.0248 7.6234 1.3680 3.1781 3.7206 2.8544 4.2396 3.9572 3.7925 3.6124 4.6175 1.4807 2.0084 1.7261 4.6557 4.6993 4.7583 2.9056 4.2099 4.5316 1.7794 3.6307 1.5366 1.7120 3.7306 4.0157 3.4826 1.2504 1.6196 3.1821 3.0157 1.7280 2.4187 4.6081 1.4350 1.3857 1.3605 5.0956 1.3450 3.3134 2.2261 2.5645 2.3073 2.2589 2.3960 1.6547 1.7574 3.5699 1.3997 1.0541 1.0597 1.7942 1.6652 1.3435 1.2837 2.1163 1.2482 1.3113 1.5021 1.6108 1.3385 1.4023 1.3073 1.3480 1.4167 1.3953 1.6667 1.6782 5.0374 1.2645 5.8767 2.2037 2.4320 1.8336 1.2001 2.5959 6.2583 6.9867 6.0412 6.3856 8.7483 1.0825 1.0823 1.0722 1.0814 1.0836 1.0881 1.0865 1.0856 1.0880 1.0944 1.0908 1.0943 1.0955 1.1008 1.1013 1.0652 1.0639 1.0663
irintensity: 0.8100 0.5424 2.6411 0.1121 0.5469 1.5817 2.2731 3.4126 0.6639 1.1557 3.4362 4.5993 1.0032 0.4031 3.9307 2.4736 0.6631 134.4350 17.9642 16.5611 0.1557 16.5167 3.1697 16.4914 9.1973 26.6666 130.8502 75.0885 56.6193 6.8921 5.5066 9.5912 7.8282 23.1257 5.4419 49.8509 10.1338 67.5429 37.9652 12.8217 7.8693 2.6707 0.0188 6.4903 7.4069 11.6337 10.1289 65.6850 53.7139 0.3515 0.0389 0.1411 1.2163 0.6009 97.2308 8.9580 7.9720 29.0042 183.3271 21.8717 5.7262 17.0451 9.1845 37.2213 0.0528 0.2751 47.3962 12.6240 2.1164 1.8464 10.6595 2.1037 16.1924 5.3415 13.2818 9.9579 18.4479 2.1208 5.5821 5.4117 5.4312 9.1428 22.7766 1.6548 8.6783 0.5395 13.7683 6.0272 18.0426 13.7436 10.2472 1.5447 1.6173 11.9002 1.5321 204.2738 21.9672 33.0360 32.4415 25.3622 12.1561 9.7461 4.9960 0.5964 3.9932 2.1149 11.6233 25.7691 33.1722 35.5733 25.8177 24.3249 27.6175 7.3109
temp: 298.150 k
press: 1.00000 atm
elementType: 8 8 8 8 6 6 6 6 6 6 6 6 6 6 6 6 6 6 6 6 6 6 1 1 1 1 1 1 1 1 1 1 1 1 1 1 1 1 1 1
symmnumber: 1
zpe: 838005.7 jmol-1
zpe.correction: 0.319180 hartree
zpe.thermalcorrener: 0.338528 hartree
zpe.thermalcorrenthalpy: 0.339472 hartree
zpe.thermalcorrgfe: 0.270848 hartree
zpe.sumelectzpe: -996.019600 hartree
zpe.sumelectthermal: -996.000252 hartree
zpe.sumelectthermalent: -995.999308 hartree
zpe.sumelectthermalfe: -996.067931 hartree
dipole: -2.8888 -1.8212 -1.9575
dipole: 3.9362
quadrupole: -128.5535 -122.2503 -120.9235
quadrupole: 1.2621 -0.5399 -5.8936
quadrupole: -4.6444 1.6588 2.9856 1.2621 -0.5399 -5.8936
hfenergy: -996.3387796 hartree
pointgroup: C01 [X(C18H18O4)]
dipole: -1.0849874 0.6898807 0.8631779 debye
polarizability: 216.3573486|-15.033512|205.3795624|1.8048021|-4.0498017|168.6831234 unknown
InChI: InChI=1S/C18H18O4/c19-10-14-16(18(21)22)15(11-6-2-1-3-7-11)12-8-4-5-9-13(12)17(14)20/h1-9,14-17,19-21H,10H2
charge 0 multiplicity 1
40 atoms
O  3.187994 0.223169 0.551033
O  2.452586 2.452277 2.336502
O  2.12973 2.492371 -1.867834
O  1.638026 0.386077 -2.688108
C  0.926568 1.272481 0.733576
C  0.375344 1.249898 -0.725804
C  -0.552021 0.007173 -0.908928
C  1.801621 0.028866 1.031549
C  0.156319 -1.27323 -0.466068
C  1.261617 -1.256612 0.422682
C  1.673006 2.580947 1.084352
C  -1.906649 0.244446 -0.219043
C  1.434957 1.268578 -1.82948
C  -0.302028 -2.516891 -0.9693
C  1.895161 -2.475407 0.774867
C  -2.245605 -0.346601 1.023854
C  -2.851905 1.105159 -0.837686
C  0.325089 -3.725604 -0.610774
C  1.43791 -3.705599 0.265456
C  -3.491356 -0.07742 1.636725
C  -4.096461 1.37683 -0.229384
C  -4.42047 0.787115 1.01538
H  0.02727 1.197886 1.381837
H  -0.222438 2.173063 -0.868448
H  -0.748695 -0.088936 -1.994562
H  1.840374 -0.096891 2.135396
H  0.958994 3.426462 1.152817
H  2.421522 2.822011 0.318939
H  -1.155139 -2.528559 -1.658528
H  2.76511 -2.442182 1.440537
H  3.593012 0.895437 1.164585
H  -1.541941 -1.037874 1.501251
H  -2.614655 1.555491 -1.810763
H  -0.040758 -4.675421 -1.016562
H  1.940581 -4.638981 0.541942
H  1.836736 2.349088 3.104977
H  2.800939 2.450934 -2.602389
H  -3.738313 -0.548337 2.595164
H  -4.814998 2.038264 -0.726698
H  -5.387632 0.991622 1.488036
