program: Gaussian 09
title: 000235416
version: EM64L-G09RevD.01
frameworkgroup: C1[X(C17H16)]
method: RPBEPBE
basis: SDD
operation: Freq
keyword: #p
keyword: freq=noraman
keyword: PBEPBE/SDD
title: #p freq=noraman PBEPBE/SDD
converged: YES YES NO NO
title: Mulliken charges:
elementType: C C C C C C C C C C C C C C C C C H H H H H H H H H H H H H H H H
charge: -0.597080 0.333844 0.130659 -0.462775 0.274150 -0.389881 0.312157 -0.440056 -0.387621 -0.425672 -0.402277 -0.242665 -0.260166 0.430296 -0.391258 -0.392280 -0.809354 0.223808 0.225764 0.215633 0.223657 0.243429 0.233392 0.261307 0.243938 0.257408 0.225567 0.226530 0.226753 0.228884 0.224625 0.224080 0.235204
chargesum: 0.00000
title: Mulliken charges with hydrogens summed into heavy atoms:
elementType: C C C C C C C C C C C C C C C C C
charge: -0.147508 0.333844 0.130659 -0.023485 0.274150 -0.146452 0.312157 -0.206664 -0.126314 -0.181733 -0.144869 -0.017098 -0.033636 0.430296 -0.164505 -0.163396 -0.125445
polarizability: 2.53953843e+02 -2.28620254e+00 1.91375653e+02 -7.60350803e+00 -6.17562875e+00 1.08489113e+02
1716.lowfreq: -2.7304 -0.0006 -0.0004 0.0005 5.0096 9.6806 25.3226 48.7223 65.4125
frequency: 25.0844 48.6731 65.3961 73.7655 129.3850 159.5503 179.2025 237.9256 278.7293 285.8580 322.3163 350.2473 408.6224 416.7520 425.8149 449.5761 488.2403 506.2909 543.5653 568.1237 605.3264 628.2877 647.4120 692.2894 726.4492 747.6114 770.3208 775.5230 790.3784 816.1047 844.2604 848.9007 852.2378 885.0541 922.8996 949.9720 955.6055 959.0692 976.2321 986.1849 991.0237 1014.1775 1032.1985 1041.4487 1046.5345 1053.7371 1108.8198 1123.8211 1151.7382 1164.6605 1175.7159 1195.4080 1200.0826 1215.2533 1224.3651 1275.2655 1283.8381 1304.3473 1312.4053 1336.5471 1349.8722 1367.5392 1379.1640 1396.8389 1407.1108 1438.7753 1451.8179 1456.7859 1471.0656 1472.7210 1483.8354 1507.0808 1569.9230 1573.9451 1609.7555 1622.3173 1625.9459 2943.9715 2956.7826 2973.0599 3037.4131 3040.5100 3053.9547 3083.2673 3114.6114 3115.1640 3116.4768 3126.4572 3129.3486 3140.4307 3145.1789 3147.4577 3161.5067
redmass: 1.0179 3.8715 3.8160 3.9991 3.2763 3.4444 3.6819 4.0550 3.0240 2.7953 3.5361 2.7788 2.8905 3.4694 3.3438 3.4424 4.6827 3.8028 3.5153 4.8564 3.2201 4.0717 4.5783 3.6002 3.0302 2.1458 4.1615 1.7478 3.6136 1.4873 1.6694 1.8627 1.3590 1.3336 2.4531 2.3032 1.8587 1.3889 1.3650 1.4067 1.3141 2.8654 2.1242 2.2709 1.5565 2.3203 1.9402 1.3155 1.2266 1.6698 1.1069 1.1208 1.3692 2.2796 2.9157 1.6469 1.5646 1.4032 1.5835 1.8869 2.0900 3.8662 4.8860 1.2249 3.1672 2.2974 1.1275 1.1071 1.0967 1.0538 2.5655 2.8052 5.7923 6.2512 6.4136 6.3916 7.6832 1.0691 1.0640 1.0387 1.0912 1.0962 1.0948 1.0997 1.0876 1.0867 1.0879 1.0916 1.0884 1.0952 1.0943 1.0957 1.1000
irintensity: 0.5218 0.2511 0.5343 0.3649 1.8216 0.1387 0.9281 0.3779 3.3899 1.1365 2.1431 0.4287 0.4515 2.0174 3.1311 3.7607 2.2175 5.1635 6.4704 6.8677 4.3499 3.2815 3.1373 4.2290 1.3295 42.4869 5.4227 31.2397 12.0286 54.5163 15.7482 7.5576 0.6115 0.7762 3.7269 5.4375 3.0711 0.4390 0.5871 0.4431 0.0090 2.2084 3.3983 9.1435 19.9617 2.6746 3.0977 9.4815 2.1250 0.9090 1.8299 3.4685 5.0305 0.5472 0.5366 6.1157 1.2000 3.7859 1.1607 7.5567 2.9266 9.3314 0.6156 8.3150 1.8591 4.2443 12.5023 12.2449 13.7547 12.2496 15.7469 34.1825 0.5619 0.8624 1.6637 2.2729 0.5940 36.7552 35.9602 44.6673 51.5820 34.0223 23.5357 18.0901 10.6658 11.8702 28.8791 13.0866 10.2155 36.6035 22.3068 5.7118 27.8317
temp: 298.150 k
press: 1.00000 atm
elementType: 6 6 6 6 6 6 6 6 6 6 6 6 6 6 6 6 6 1 1 1 1 1 1 1 1 1 1 1 1 1 1 1 1
symmnumber: 1
zpe: 718146.4 jmol-1
zpe.correction: 0.273528 hartree
zpe.thermalcorrener: 0.287800 hartree
zpe.thermalcorrenthalpy: 0.288744 hartree
zpe.thermalcorrgfe: 0.231242 hartree
zpe.sumelectzpe: -656.230366 hartree
zpe.sumelectthermal: -656.216094 hartree
zpe.sumelectthermalent: -656.215150 hartree
zpe.sumelectthermalfe: -656.272651 hartree
dipole: 0.2543 0.4839 0.1700
dipole: 0.5725
quadrupole: -86.2404 -92.4759 -102.5174
quadrupole: -2.5323 -1.8978 -1.7812
quadrupole: 7.5042 1.2687 -8.7728 -2.5323 -1.8978 -1.7812
hfenergy: -656.5038938 hartree
pointgroup: C01 [X(C17H16)]
dipole: 0.1075856 -0.1978154 -0.005077 debye
polarizability: 252.9830198|7.8946539|181.2177225|11.4702623|-27.8652928|119.6178667 unknown
InChI: InChI=1S/C17H16/c1-13-9-11-15(12-10-13)17-8-4-6-14-5-2-3-7-16(14)17/h2-3,5,7-12H,4,6H2,1H3
charge 0 multiplicity 1
33 atoms
C  -2.899591 -1.856914 -0.30186
C  -2.700623 -0.347671 -0.280878
C  -1.391096 0.170726 -0.021276
C  -2.023588 -2.542999 0.771333
C  -0.279642 -0.781136 0.274237
C  -0.588705 -2.06305 0.657279
C  1.148517 -0.350205 0.167014
C  -3.766359 0.542644 -0.532632
C  -1.203782 1.578973 -0.004799
C  2.096197 -0.711433 1.162365
C  1.617076 0.394686 -0.950215
C  -3.565036 1.943344 -0.52645
C  -2.2781 2.459933 -0.2560
C  3.924934 0.377781 -0.080843
C  3.45575 -0.354247 1.039946
C  2.977203 0.747783 -1.070387
C  5.39374 0.736568 -0.22676
H  -3.966123 -2.10987 -0.159049
H  -2.604469 -2.248951 -1.298543
H  -2.071096 -3.641831 0.659718
H  -2.418186 -2.30941 1.784661
H  0.219013 -2.770536 0.881342
H  -4.765774 0.13649 -0.732557
H  -0.2124 1.984935 0.221566
H  1.754214 -1.254183 2.051238
H  0.910996 0.682763 -1.737027
H  -4.40382 2.62092 -0.721715
H  -2.112338 3.542847 -0.234682
H  4.161585 -0.63762 1.830769
H  3.310336 1.316819 -1.947348
H  5.527508 1.676871 -0.790435
H  5.88179 0.854609 0.756889
H  5.943871 -0.054535 -0.773203
