program: Gaussian 09
title: 000020732
version: EM64L-G09RevD.01
frameworkgroup: C1[X(C19H32N2O2S)]
method: RPBEPBE
basis: SDD
operation: Freq
keyword: #p
keyword: freq=noraman
keyword: PBEPBE/SDD
title: #p freq=noraman PBEPBE/SDD
converged: YES YES NO NO
title: Mulliken charges:
elementType: S O O N N C C C C C C C C C C C C C C C C C C C H H H H H H H H H H H H H H H H H H H H H H H H H H H H H H H H
charge: 0.174371 -0.270683 -0.224511 -0.088684 -0.690545 -0.358236 -0.341980 -0.412349 -0.305981 -0.357636 -0.304941 -0.322234 -0.384395 -0.692140 -0.696144 -0.693640 -0.683833 0.339184 0.254235 -0.281040 -0.556961 -0.331289 0.541567 -0.457106 0.175638 0.238231 0.176799 0.192811 0.225062 0.187338 0.208495 0.234762 0.192035 0.200853 0.217676 0.201965 0.182057 0.239742 0.214504 0.211895 0.260475 0.286909 0.211174 0.207597 0.215106 0.226689 0.207784 0.209128 0.223008 0.219628 0.211169 0.243035 0.276687 0.223029 0.309207 0.314485
chargesum: 0.00000
title: Mulliken charges with hydrogens summed into heavy atoms:
elementType: S O O N N C C C C C C C C C C C C C C C C C C C
charge: 0.174371 -0.270683 -0.224511 -0.088684 -0.066854 0.055632 0.027630 0.000050 0.137275 0.035252 0.114700 0.099565 0.042004 -0.144757 -0.062267 -0.050039 -0.030028 0.339184 0.254235 -0.281040 -0.313926 -0.054602 0.541567 -0.234076
polarizability: 3.55297068e+02 3.08438870e+01 2.83719031e+02 -2.14088617e+01 -1.88721674e+01 1.72116502e+02
1716.lowfreq: -2.2227 -0.0016 -0.0011 0.0013 5.8241 7.6803 15.4077 18.3827 26.5887
frequency: 14.2616 18.1891 26.5721 30.9193 34.1026 43.6988 48.0911 57.4780 74.3538 83.8949 94.1075 95.0883 104.3994 118.5468 133.8986 149.3396 157.0085 162.2175 207.6606 214.2899 217.4112 222.8421 234.0160 261.8385 272.8702 280.7925 287.2342 296.2672 308.3944 330.1637 338.8508 386.1401 391.9728 397.5383 401.7553 413.5393 453.0611 462.0538 481.2524 486.6718 488.9457 528.6836 589.1158 608.7583 642.8560 654.7353 678.4495 718.6825 729.3937 730.2688 733.0760 756.4480 759.8629 771.2795 799.6252 814.0978 824.7841 836.4982 873.9436 884.9427 891.9237 893.4716 901.1529 965.4910 968.0787 982.1819 982.6244 1004.4417 1028.9576 1032.1632 1035.3386 1047.9694 1057.2834 1069.6438 1080.4249 1080.6079 1083.3648 1110.0139 1121.8388 1124.9493 1140.4583 1145.3389 1190.5765 1199.5707 1204.2034 1214.3374 1220.1524 1227.2917 1256.3380 1258.9437 1265.5952 1272.3354 1282.5327 1288.1938 1297.3368 1304.0012 1320.7341 1330.9809 1331.8462 1340.1229 1354.4774 1359.7911 1361.9522 1371.2928 1372.0248 1378.4625 1386.0605 1388.1880 1400.6885 1417.5093 1448.3024 1449.9437 1455.2464 1465.2664 1465.5012 1469.3702 1470.4231 1474.7732 1474.9329 1476.0302 1481.1492 1481.6003 1488.3378 1488.8713 1500.5879 1509.8648 1539.1139 1572.7792 1630.8435 1645.2203 2867.5356 2920.3348 2947.8098 2950.6357 2959.6538 2968.8843 2971.1798 2976.2380 2978.5618 2981.1278 2985.2224 2994.8636 3012.6624 3022.1476 3029.5141 3034.3759 3035.5293 3036.6470 3042.7151 3057.0004 3067.9160 3070.1526 3070.7209 3074.6258 3080.2437 3087.8147 3122.0141 3132.9476 3151.0938 3163.1602 3561.9759 3701.9337
redmass: 4.1244 3.9972 5.0497 3.5418 3.9738 3.9741 3.2023 1.5343 3.8251 3.2198 3.8552 3.3405 3.7746 3.6226 1.9381 3.1886 2.0161 2.1223 2.1490 1.3789 3.5791 1.1962 2.6402 2.9309 2.5437 1.6634 2.7240 5.1506 5.1420 3.6155 3.0372 5.1771 3.5706 2.4160 1.0562 1.2439 2.8615 5.9021 3.0716 2.8043 3.0279 5.3864 4.7871 8.7348 3.1557 5.9724 4.7080 2.3675 1.3484 1.4959 2.3786 1.7640 1.4172 1.1353 1.1980 1.5296 1.5216 2.1029 6.7996 2.3638 2.0548 1.9358 1.7073 1.6675 2.5389 1.8907 1.4335 1.6497 3.4219 2.7417 1.9059 1.6278 2.3706 2.5582 2.1309 2.2488 1.9665 1.6938 2.1929 1.9217 1.4586 1.7157 2.1097 1.4491 2.0848 2.5834 1.3403 1.5172 1.2724 1.3041 1.5101 1.3020 1.1438 1.0575 1.1513 1.2094 1.3134 2.1133 1.2873 1.2597 1.5685 1.3051 1.5158 1.6198 1.2284 1.2450 1.3153 1.2248 4.9029 1.1065 3.3420 1.0826 1.0639 1.0589 1.0587 1.0689 1.0692 1.1832 1.0518 1.0435 1.0722 1.0499 1.0689 1.0915 1.0810 3.2796 9.0363 7.9113 4.0280 1.3087 1.0718 1.0679 1.0550 1.0592 1.0651 1.0582 1.0389 1.0353 1.0639 1.0405 1.0558 1.0957 1.1054 1.0997 1.0931 1.0918 1.0982 1.0969 1.0576 1.1023 1.1008 1.0993 1.0991 1.0981 1.1007 1.1003 1.1068 1.0890 1.0902 1.0954 1.0451 1.1040
irintensity: 0.2733 0.9072 1.7115 0.4100 0.4611 0.7878 1.7457 0.0632 0.2872 0.5564 1.0482 0.9914 1.0533 0.4013 0.0771 1.0451 0.6949 2.9929 1.1527 0.3112 1.3618 0.0711 4.3206 4.9323 2.3519 0.8675 3.2620 8.5879 5.8954 0.6230 1.1707 1.8015 1.9703 2.9418 40.4038 248.1383 2.6881 22.5185 3.0813 8.3703 5.9318 10.6065 7.7235 2.7887 11.6977 48.0611 20.7754 3.3393 9.3187 4.7850 1.5993 11.7594 0.1605 6.9330 3.8568 8.1688 7.4878 76.0370 152.0761 7.5977 4.8173 13.2025 16.8258 1.0303 10.2612 35.1004 7.9357 9.5201 2.0244 4.6917 18.8439 1.2832 2.6640 77.2490 10.4490 9.6786 8.1293 20.1043 69.5364 124.2466 38.4378 4.5315 119.8856 3.2957 46.4432 133.3163 6.9796 10.1858 0.6239 32.7475 131.2606 27.1930 7.5216 1.6614 1.3151 13.5546 3.5195 116.4471 12.4265 10.8751 5.8201 4.3525 25.4967 0.5844 26.8194 3.0721 22.6444 14.4987 3.3078 20.7485 85.1414 9.3020 10.4453 4.3495 9.4066 0.5814 1.7085 7.4346 3.9890 11.4713 1.9031 7.2452 19.3136 20.0917 3.1950 18.9703 166.5185 209.0027 335.3329 398.9831 78.0150 48.4994 34.3335 17.1797 14.1859 77.5476 28.1799 31.8340 48.5427 26.8786 62.7100 8.3588 40.7369 28.2192 9.4240 10.9578 9.5654 24.8011 20.8890 44.2094 111.7635 48.6195 52.9205 65.9767 45.7480 48.1364 5.4753 14.1392 14.1724 12.8592 126.2071 22.6980
temp: 298.150 k
press: 1.00000 atm
elementType: 16 8 8 7 7 6 6 6 6 6 6 6 6 6 6 6 6 6 6 6 6 6 6 6 1 1 1 1 1 1 1 1 1 1 1 1 1 1 1 1 1 1 1 1 1 1 1 1 1 1 1 1 1 1 1 1
symmnumber: 1
zpe: 1259702.9 jmol-1
zpe.correction: 0.479796 hartree
zpe.thermalcorrener: 0.508609 hartree
zpe.thermalcorrenthalpy: 0.509553 hartree
zpe.thermalcorrgfe: 0.416288 hartree
zpe.sumelectzpe: -1399.332089 hartree
zpe.sumelectthermal: -1399.303276 hartree
zpe.sumelectthermalent: -1399.302332 hartree
zpe.sumelectthermalfe: -1399.395597 hartree
dipole: -6.2338 0.6606 1.9384
dipole: 6.5616
quadrupole: -111.2409 -146.0065 -159.2558
quadrupole: 12.2479 -3.4113 -6.1469
quadrupole: 27.5935 -7.1721 -20.4214 12.2479 -3.4113 -6.1469
hfenergy: -1399.811885 hartree
pointgroup: C01 [X(C19H32N2O2S1)]
dipole: -2.0275812 1.5128054 0.5143814 debye
polarizability: 359.3894319|-22.0328686|259.9236958|-39.9094846|-33.2869486|191.8194738 unknown
InChI: InChI=1S/C19H32N2O2S/c1-4-7-8-9-13-23-18-15-16(20)10-11-17(18)19(22)24-14-12-21(5-2)6-3/h10-11,15H,4-9,12-14,20H2,1-3H3
charge 0 multiplicity 1
56 atoms
S  0.601961 -0.269803 -1.059113
O  -1.643822 1.349584 -0.761735
O  -0.154334 -2.437733 0.4065
N  3.986284 -2.396096 0.182491
N  -5.85729 0.300374 1.496019
C  0.18289 3.71582 -1.027157
C  1.318148 4.423351 -1.799376
C  -1.03042 3.381282 -1.92216
C  2.968491 -1.318091 0.157788
C  2.534458 4.764272 -0.908445
C  -2.162381 2.670914 -1.176463
C  3.486715 -3.648794 0.806401
C  5.339972 -1.963354 0.601935
C  2.061176 -1.477219 -1.079665
C  3.670395 5.468074 -1.682065
C  4.281982 -4.89763 0.381354
C  5.495018 -1.532595 2.088247
C  -2.452832 0.49273 -0.022833
C  -1.892938 -0.778267 0.339539
C  -0.54614 -1.302401 0.006363
C  -3.765986 0.844939 0.361699
C  -2.722396 -1.650449 1.107018
C  -4.565381 -0.051089 1.122328
C  -4.021587 -1.316645 1.496792
H  -0.147384 4.361813 -0.185857
H  0.564946 2.777926 -0.581583
H  0.931795 5.356391 -2.262587
H  1.650848 3.774147 -2.63606
H  -0.708526 2.741225 -2.765932
H  -1.446233 4.312779 -2.359473
H  3.480398 -0.338447 0.110868
H  2.333932 -1.310969 1.07301
H  2.202171 5.408945 -0.069028
H  2.918873 3.830926 -0.449595
H  -3.047272 2.520987 -1.828584
H  -2.466207 3.244154 -0.275233
H  3.471265 -3.579337 1.923018
H  2.43217 -3.770309 0.498451
H  6.049603 -2.78382 0.384913
H  5.635903 -1.119538 -0.051289
H  2.610752 -1.270129 -2.012216
H  1.631826 -2.490587 -1.119024
H  4.03964 4.831678 -2.508507
H  3.318787 6.41964 -2.124393
H  4.528331 5.698067 -1.023655
H  4.296605 -4.982537 -0.719695
H  5.327897 -4.867677 0.738151
H  3.813991 -5.808081 0.799798
H  4.81321 -0.697448 2.333969
H  5.275167 -2.367075 2.778711
H  6.530689 -1.19631 2.284039
H  -4.183581 1.815176 0.076567
H  -2.292175 -2.618147 1.384108
H  -4.622744 -2.020017 2.083873
H  -6.255535 1.197925 1.23525
H  -6.430726 -0.339929 2.037719
