program: Gaussian 09
title: 000020632
version: EM64L-G09RevD.01
frameworkgroup: C1[X(C19H32)]
method: RPBEPBE
basis: SDD
operation: Freq
keyword: #p
keyword: freq=noraman
keyword: PBEPBE/SDD
title: #p freq=noraman PBEPBE/SDD
converged: YES YES NO NO
title: Mulliken charges:
elementType: C C C C C C C C C C C C C C C C C C C H H H H H H H H H H H H H H H H H H H H H H H H H H H H H H H H
charge: -0.186762 -0.445827 -0.440479 -0.384694 -0.375814 -0.376941 0.499942 -0.377347 -0.348449 -0.354029 -0.360558 -0.403092 -0.446306 -0.357167 -0.247626 -0.228139 -0.698238 -0.248449 -0.697084 0.195645 0.195879 0.198330 0.194764 0.196830 0.220022 0.185996 0.182408 0.217085 0.188879 0.192742 0.188860 0.193294 0.188554 0.184816 0.187978 0.186814 0.198462 0.194348 0.227323 0.230962 0.194465 0.195584 0.221071 0.222542 0.214939 0.208943 0.210046 0.225709 0.209684 0.214756 0.209330
chargesum: 0.00000
title: Mulliken charges with hydrogens summed into heavy atoms:
elementType: C C C C C C C C C C C C C C C C C C C
charge: 0.008883 -0.051617 -0.048886 0.021323 0.023679 0.004681 0.499942 0.004808 0.024920 0.020763 0.032251 -0.175769 -0.215344 0.032882 -0.026555 -0.005596 -0.064310 -0.022740 -0.063315
polarizability: 2.16644661e+02 -1.90090934e+00 2.10467022e+02 1.37521640e-01 -2.21334528e+00 1.78160956e+02
1716.lowfreq: -2.5479 -0.0013 0.0002 0.0011 4.8397 9.1700 21.2648 28.7844 34.1745
frequency: 21.0862 28.7614 34.1118 35.9727 47.5245 50.9772 61.7045 80.0631 94.5269 100.9242 122.0073 127.7995 141.9503 143.1987 169.2888 174.4576 209.9573 220.1720 233.9670 241.0123 242.4081 320.3959 335.2927 362.7877 404.3811 433.5723 446.7493 474.7562 515.1052 556.4699 576.2990 617.1445 704.8945 721.3408 722.8378 726.8980 733.7468 747.9057 771.9088 776.1370 821.6725 850.3689 851.5340 886.5170 889.4431 910.3842 916.2987 955.8979 971.9817 973.1092 986.2528 991.2343 992.0468 999.4641 1006.4439 1025.5001 1030.2973 1045.0604 1052.7704 1062.5896 1070.0212 1077.5690 1079.7100 1081.2980 1099.2982 1115.3220 1118.7331 1134.7031 1170.4402 1186.9048 1189.8286 1196.0651 1201.3202 1214.2925 1230.3900 1238.2245 1252.7680 1262.6892 1268.3281 1282.5118 1285.0184 1288.0443 1289.8365 1293.4215 1295.8481 1306.0037 1315.0187 1318.0115 1340.3512 1346.2096 1352.4685 1353.2876 1353.8789 1360.8486 1383.4854 1387.2261 1387.7672 1440.0451 1455.0352 1460.4750 1460.8107 1462.3489 1464.2977 1468.0339 1470.4245 1475.8834 1477.3300 1478.5946 1479.5793 1481.9276 1483.3276 1487.4574 1488.0225 1590.8362 1612.0216 2947.1526 2949.0424 2949.5197 2951.2703 2952.2398 2954.0031 2956.1180 2960.0759 2963.8868 2967.1224 2968.1990 2970.6186 2970.7263 2983.5369 2989.9335 2992.1788 2999.0943 3004.7287 3012.6721 3019.5004 3029.7155 3039.0158 3042.4303 3067.5431 3067.5932 3069.2804 3069.4929 3112.8581 3114.2202 3129.8327 3140.3372 3159.6051
redmass: 3.8493 3.8645 3.7420 3.6191 1.7204 1.6847 2.7752 3.5517 2.1363 1.9938 2.0409 2.0932 3.0184 2.0098 3.8862 2.5946 3.1932 2.8386 1.1161 1.1307 3.0255 3.2279 3.2137 3.4554 2.8067 3.2797 3.0174 3.1943 3.3602 2.7142 2.6850 6.3787 1.6560 1.2780 1.0659 1.3180 1.3354 1.1975 1.3823 1.7172 1.2637 1.2818 1.2690 1.9311 1.8427 1.2753 1.4643 1.2890 2.5787 1.7754 3.0978 2.1204 1.8656 1.4685 4.0558 2.3440 2.3517 2.2252 1.8641 2.7751 1.5478 2.2015 2.3615 2.1056 1.9023 1.8841 2.2177 2.4215 1.0586 1.1130 1.7341 1.7711 1.7637 1.3089 1.3808 1.3503 1.3175 1.2784 1.2723 1.1252 1.0981 1.1073 1.2036 1.1235 1.0972 1.2964 1.3334 1.3548 1.4871 1.4460 1.5167 1.6279 1.6882 1.5889 5.0693 1.2181 1.2182 2.1321 1.0776 1.0730 1.0762 1.0722 1.0745 1.0789 1.0814 1.0854 1.0428 1.0446 1.1089 1.8257 1.1797 1.0869 1.0915 5.9583 6.1620 1.0592 1.0590 1.0622 1.0746 1.0597 1.0606 1.0615 1.0613 1.0621 1.0589 1.0596 1.0366 1.0370 1.0963 1.0959 1.0979 1.1000 1.0990 1.1035 1.1033 1.1043 1.1041 1.1038 1.1007 1.1007 1.0993 1.0993 1.0850 1.0875 1.0909 1.0959 1.1014
irintensity: 0.0036 0.0089 0.0081 0.0167 0.0030 0.0076 0.0057 0.0284 0.0387 0.0145 0.0154 0.0031 0.1115 0.0044 0.1353 0.5783 0.0733 0.1324 0.0023 0.0094 0.2008 0.3248 0.0991 0.0182 0.0169 0.3315 0.0654 5.0781 1.1110 0.2400 15.8409 0.0532 55.2712 17.9689 10.4760 2.4789 1.2380 8.4950 5.1946 25.9165 1.9737 1.1549 1.1550 6.5398 3.0984 3.1692 3.9936 0.6440 0.1751 0.2323 0.5455 0.6865 0.3130 0.5216 0.1497 6.3205 0.8999 0.4781 0.1330 0.1801 8.7291 0.5234 1.2717 0.3689 14.8633 5.3650 10.6957 0.7181 0.0462 0.1025 0.1414 1.1005 0.4482 11.3247 0.4218 1.3116 0.4851 0.0782 0.1362 0.5992 0.5363 0.5881 0.0672 0.1891 0.7061 0.4861 2.2378 0.1587 0.1524 1.1349 1.0142 1.0592 0.5236 6.0343 0.7561 11.0487 11.6836 8.4972 0.3218 0.1107 0.8627 0.1457 1.0866 0.3576 1.9217 0.8285 12.2989 11.0323 3.3178 9.6739 7.1210 13.5025 31.8449 1.3638 8.0269 0.5177 0.2378 3.3094 11.5276 0.7688 6.8948 4.3459 1.8498 27.2693 87.9303 224.8037 48.8676 26.4406 2.5074 3.8486 3.0082 0.0882 13.4081 3.7261 0.3120 6.8048 20.6921 249.3730 5.7288 186.5928 54.2346 54.5435 11.3798 2.6794 12.1602 46.6256 25.5614
temp: 298.150 k
press: 1.00000 atm
elementType: 6 6 6 6 6 6 6 6 6 6 6 6 6 6 6 6 6 6 6 1 1 1 1 1 1 1 1 1 1 1 1 1 1 1 1 1 1 1 1 1 1 1 1 1 1 1 1 1 1 1 1
symmnumber: 1
zpe: 1208925.1 jmol-1
zpe.correction: 0.460455 hartree
zpe.thermalcorrener: 0.483278 hartree
zpe.thermalcorrenthalpy: 0.484222 hartree
zpe.thermalcorrgfe: 0.404748 hartree
zpe.sumelectzpe: -741.714125 hartree
zpe.sumelectthermal: -741.691303 hartree
zpe.sumelectthermalent: -741.690359 hartree
zpe.sumelectthermalfe: -741.769832 hartree
dipole: 0.0240 -0.2600 -0.0696
dipole: 0.2702
quadrupole: -126.9475 -117.2699 -115.9918
quadrupole: -0.5113 -0.1023 1.2970
quadrupole: -6.8777 2.7998 4.0779 -0.5113 -0.1023 1.2970
hfenergy: -742.1745804 hartree
pointgroup: C01 [X(C19H32)]
dipole: -0.0098503 0.1023915 -0.0268274 debye
polarizability: 216.6709685|-1.8901072|210.3983814|0.5611878|2.4177118|178.2032895 unknown
InChI: InChI=1S/C19H32/c1-3-5-7-8-11-15-18(14-10-6-4-2)19-16-12-9-13-17-19/h9,12-13,16-18H,3-8,10-11,14-15H2,1-2H3
charge 0 multiplicity 1
51 atoms
C  0.834252 0.531903 -0.229171
C  -0.511731 1.046033 0.361688
C  2.035295 1.306614 0.390348
C  -1.768095 0.459042 -0.318424
C  3.392079 1.018727 -0.289389
C  -3.084625 1.03245 0.252181
C  0.989613 -0.982913 -0.06701
C  -4.347977 0.4494 -0.420388
C  4.564037 1.799386 0.347175
C  -5.665012 1.03119 0.140897
C  5.921262 1.532539 -0.343157
C  1.033362 -1.5773 1.222909
C  1.096642 -1.8331 -1.196517
C  -6.929139 0.443869 -0.527653
C  1.180062 -2.973029 1.377324
C  1.243999 -3.23214 -1.049358
C  7.090864 2.3040 0.305775
C  1.286524 -3.808731 0.240196
C  -8.239906 1.035605 0.034566
H  0.823048 0.754639 -1.317993
H  -0.532456 2.152107 0.270264
H  -0.545364 0.823724 1.448665
H  1.820743 2.393857 0.328524
H  2.109138 1.065535 1.471215
H  -1.768061 -0.643589 -0.207912
H  -1.722957 0.663414 -1.409269
H  3.322985 1.276898 -1.367484
H  3.607125 -0.067303 -0.241632
H  -3.08575 2.13715 0.137801
H  -3.127021 0.833746 1.343827
H  -4.301311 0.638003 -1.513638
H  -4.351725 -0.653751 -0.29624
H  4.642537 1.529763 1.421488
H  4.345787 2.887857 0.315486
H  -5.711392 0.846547 1.234812
H  -5.663602 2.134186 0.012667
H  6.13395 0.444348 -0.316843
H  5.844266 1.807604 -1.415068
H  0.951108 -0.943915 2.114991
H  1.06492 -1.393733 -2.201479
H  -6.879523 0.624529 -1.621099
H  -6.931949 -0.657458 -0.395193
H  1.211419 -3.410519 2.382131
H  1.324993 -3.868947 -1.937971
H  8.048219 2.098366 -0.20784
H  6.91465 3.395848 0.26833
H  7.210122 2.020959 1.368838
H  1.400278 -4.892241 0.358869
H  -8.326635 0.844409 1.120996
H  -9.127861 0.597499 -0.457616
H  -8.276188 2.13132 -0.115818
