program: Gaussian 09
title: 000235408
version: EM64L-G09RevD.01
frameworkgroup: C1[X(C12H20S2)]
method: RPBEPBE
basis: SDD
operation: Freq
keyword: #pfreq=noraman
keyword: PBEPBE/SDD
title: #p freq=noraman PBEPBE/SDD
converged: YES YES NO NO
title: Mulliken charges:
elementType: S S C C C C C C C C C C C C H H H H H H H H H H H H H H H H H H H H
charge: 0.188838 0.284577 0.300163 -0.350364 -0.087833 -0.720387 -0.730864 -0.700399 -0.685435 -0.716970 0.001773 -0.099014 -0.630668 -0.556195 0.235195 0.194024 0.211896 0.209605 0.210612 0.234941 0.204432 0.208080 0.197245 0.211376 0.216745 0.225117 0.212770 0.244727 0.231031 0.218614 0.227682 0.263936 0.277784 0.266966
chargesum: 0.00000
title: Mulliken charges with hydrogens summed into heavy atoms:
elementType: S S C C C C C C C C C C C C
charge: 0.188838 0.284577 0.300163 0.078855 -0.087833 -0.088273 -0.083411 -0.075034 -0.002821 -0.039643 0.001773 0.164922 -0.352884 -0.289228
polarizability: 1.97789930e+02 1.33393615e+01 1.60938376e+02 9.79869521e+00 -4.80838279e+00 1.22982118e+02
1716.lowfreq: -3.0894 0.0009 0.0018 0.0019 6.5143 13.7089 28.3854 45.2652 63.1888
frequency: 28.1846 45.2154 62.7506 90.2970 115.0090 175.6259 201.6060 214.3385 233.6274 236.2251 256.3002 270.2133 271.9901 285.3679 300.9701 306.5053 310.0794 347.6992 376.2730 378.8642 409.9571 420.9842 440.2697 456.7011 501.1755 548.9759 605.7757 623.3231 683.6522 728.7039 732.6329 775.7750 797.9210 800.3108 857.3982 877.1475 895.0895 903.0822 925.4234 928.2978 940.7126 944.0410 985.8084 1005.0439 1023.3915 1033.5951 1076.7027 1091.6101 1105.7366 1147.5614 1183.5212 1200.0284 1210.3887 1239.0574 1255.0113 1315.3756 1329.4512 1349.1891 1372.4227 1378.4757 1381.5259 1395.7114 1405.5820 1434.4254 1447.3939 1454.5367 1457.8334 1461.2635 1467.4075 1470.3827 1474.2591 1479.6392 1486.6577 1494.8273 1497.4705 1500.6202 2938.0296 2963.5160 2969.0233 2972.1154 2978.8088 2984.4580 2998.4827 3055.6212 3060.4543 3062.2083 3063.6561 3070.8771 3074.9855 3088.9664 3089.8472 3092.8837 3098.5360 3185.6221 3236.5894 3240.7225
redmass: 4.5982 5.3363 3.0048 3.8141 3.8466 1.7143 1.9062 2.3064 3.3029 1.5834 1.7085 2.1318 1.0701 1.4335 1.9167 2.9673 1.1930 2.4000 2.4528 3.0093 1.8548 3.9506 3.3338 4.3915 2.9152 2.9027 7.9838 3.5557 1.2176 6.9178 3.6587 1.3256 4.9599 3.0926 1.8199 5.0999 1.3111 2.1448 1.6711 1.6421 1.3921 1.2165 1.6637 1.3318 1.4194 1.4170 1.6979 1.1211 1.5388 2.5464 1.3467 2.0075 2.6707 3.5523 3.1942 1.4489 2.3290 1.3697 1.1930 1.1979 1.2028 1.2028 1.2039 8.1649 1.0746 1.0575 1.0478 1.0509 1.0496 1.0538 1.0524 1.0526 1.0625 1.0680 1.0558 5.4505 1.0619 1.0347 1.0371 1.0371 1.0379 1.0363 1.0960 1.0993 1.0991 1.0967 1.0991 1.0977 1.0994 1.0993 1.0987 1.0974 1.0969 1.0921 1.0965 1.1004
irintensity: 0.0974 0.0506 0.0458 0.3736 0.6775 0.1105 0.0413 1.3511 1.0574 0.0902 0.0285 0.5368 0.1999 0.3116 0.3354 0.4508 0.1440 0.2365 0.1631 0.1955 0.1540 0.6276 0.0673 0.5191 5.2196 3.3066 3.3237 25.4949 6.3248 0.5859 0.1522 96.6192 34.4617 1.4591 5.2132 15.8840 1.8519 2.4933 1.3597 1.5890 2.0932 0.2330 8.9428 1.2253 0.1018 0.2729 1.0844 15.8061 31.4522 5.8650 6.3772 64.4636 2.1368 13.6063 17.3084 4.1039 6.8931 11.8423 11.4890 18.9157 28.4831 18.5801 17.3356 10.0202 4.2172 5.3977 0.8230 2.4750 4.8952 2.9050 15.2558 6.8606 6.8384 26.4673 19.2663 2.7106 25.7520 31.7795 29.6470 47.1054 24.9933 33.4575 11.4133 7.0671 35.3560 35.0511 7.3074 121.4049 46.1869 8.2186 31.1002 52.3035 20.4583 0.9326 0.0573 1.0441
temp: 298.150 k
press: 1.00000 atm
elementType: 16 16 6 6 6 6 6 6 6 6 6 6 6 6 1 1 1 1 1 1 1 1 1 1 1 1 1 1 1 1 1 1 1 1
symmnumber: 1
zpe: 754495.5 jmol-1
zpe.correction: 0.287372 hartree
zpe.thermalcorrener: 0.304291 hartree
zpe.thermalcorrenthalpy: 0.305235 hartree
zpe.thermalcorrgfe: 0.243355 hartree
zpe.sumelectzpe: -1264.262024 hartree
zpe.sumelectthermal: -1264.245105 hartree
zpe.sumelectthermalent: -1264.244161 hartree
zpe.sumelectthermalfe: -1264.306041 hartree
dipole: 0.6803 0.2959 -1.8167
dipole: 1.9623
quadrupole: -97.6747 -100.1451 -105.9014
quadrupole: -1.3086 2.9315 -4.0123
quadrupole: 3.5657 1.0953 -4.6610 -1.3086 2.9315 -4.0123
hfenergy: -1264.549396 hartree
pointgroup: C01 [X(C12H20S2)]
dipole: 0.2393941 0.1297329 -0.7224272 debye
polarizability: 196.32529|15.6307921|162.8458555|7.9825151|-4.8173859|122.5392784 unknown
InChI: InChI=1S/C12H20S2/c1-11(2,3)9-12(4,5)14-10-6-7-13-8-10/h6-8H,9H2,1-5H3
charge 0 multiplicity 1
34 atoms
S  -0.464736 1.141963 1.307779
S  -3.579761 -1.7273 0.043953
C  2.333422 -0.906913 -0.096911
C  1.212964 -0.040817 -0.772751
C  0.736242 1.342796 -0.24477
C  2.274258 -2.297919 -0.798168
C  3.751825 -0.320196 -0.350028
C  2.129115 -1.124194 1.424839
C  -0.063176 2.04761 -1.364511
C  1.827162 2.291741 0.294821
C  -1.886849 0.22646 0.615846
C  -3.027483 0.85702 -0.021194
C  -2.0223 -1.150565 0.72603
C  -4.0173 -0.035307 -0.388711
H  0.302894 -0.669894 -0.85918
H  1.547677 0.132665 -1.819948
H  3.072433 -2.962231 -0.416828
H  2.407933 -2.19995 -1.892766
H  1.301642 -2.794521 -0.618556
H  3.914534 0.634775 0.17609
H  3.923433 -0.150396 -1.430562
H  4.523214 -1.030082 0.004913
H  2.906929 -1.811716 1.81043
H  1.140073 -1.565884 1.641742
H  2.191331 -0.181899 1.995161
H  -0.520781 2.982003 -0.994566
H  0.614265 2.299757 -2.204387
H  -0.864573 1.397688 -1.758379
H  1.384394 3.267235 0.565587
H  2.590179 2.465856 -0.486379
H  2.333962 1.887365 1.186713
H  -3.095655 1.936288 -0.173962
H  -1.337907 -1.864922 1.178957
H  -4.97296 0.154581 -0.8734
