program: Gaussian 09
title: 000235389
version: EM64L-G09RevD.01
frameworkgroup: C1[X(C17H15BrO3)]
method: RPBEPBE
basis: SDD
operation: Freq
keyword: #p
keyword: freq=noraman
keyword: PBEPBE/SDD
title: #p freq=noraman PBEPBE/SDD
converged: YES YES NO NO
title: Mulliken charges:
elementType: Br O O O C C C C C C C C C C C C C C C C C H H H H H H H H H H H H H H H
charge: 0.025331 -0.277494 -0.204789 -0.207244 -0.328566 -0.687353 0.446084 0.237476 0.226658 -0.398011 -0.384792 0.317761 -0.224597 -0.228075 -0.240340 -0.328048 -0.343184 -0.248335 -0.229027 -0.222092 -0.496967 0.319484 0.326077 0.252182 0.259038 0.230003 0.225469 0.244018 0.277535 0.230333 0.233587 0.235838 0.235740 0.251270 0.245723 0.229307
chargesum: 0.00000
title: Mulliken charges with hydrogens summed into heavy atoms:
elementType: Br O O O C C C C C C C C C C C C C C C C C
charge: 0.025331 -0.277494 -0.204789 -0.207244 -0.009082 -0.361277 0.446084 0.237476 0.226658 -0.145829 -0.125754 0.317761 0.005406 -0.002606 -0.010006 -0.084030 -0.065649 -0.014748 0.006811 0.013648 0.229333
polarizability: 2.09927966e+02 8.34364209e+00 2.26081829e+02 1.43058383e+01 -1.25238113e+01 1.83156329e+02
1716.lowfreq: -8.1377 -2.3439 -0.0007 -0.0006 -0.0005 5.6457 21.3354 24.8475 39.1779
frequency: 21.1106 24.8311 39.0975 42.2885 55.7706 64.8940 66.4695 83.8783 91.2766 126.5063 147.8708 160.4976 177.5679 206.0249 210.8026 250.5373 269.9790 298.0724 332.5507 399.0556 401.9308 416.4310 442.7935 482.9014 514.5120 541.4801 604.8020 609.0386 614.2907 627.2429 674.8895 691.5211 699.1708 710.3058 713.2070 766.6856 783.3963 803.4652 815.4515 843.0535 851.8308 854.8531 925.1539 944.8802 971.7441 976.7874 983.4403 988.9695 991.2520 991.6491 996.7380 1010.6588 1027.3205 1028.3763 1071.7352 1088.5171 1089.5492 1113.2100 1141.4527 1147.9179 1172.7331 1174.0842 1175.0392 1187.5959 1193.1553 1196.2567 1211.6172 1260.9211 1266.5084 1316.0305 1336.3153 1352.8097 1384.8340 1388.9748 1422.2553 1436.8976 1443.0902 1451.5741 1463.1263 1479.0978 1481.2559 1561.5563 1592.4059 1594.3002 1607.1793 1610.6214 1651.8684 3006.8104 3075.8271 3110.7642 3119.2227 3125.2193 3131.7571 3134.0903 3141.5425 3145.7417 3149.9119 3152.2220 3154.2749 3161.5899 3167.1787 3171.7435
redmass: 5.8197 5.2288 3.9333 4.6992 1.8982 4.3135 5.2349 2.2554 5.0227 8.9207 6.3698 6.3008 5.1493 5.5012 7.1705 4.9343 4.9361 6.1655 5.8529 2.7934 2.8017 4.8026 5.8822 4.2013 5.0803 5.5633 5.4143 6.1950 6.3011 6.6826 6.5406 2.2018 2.2861 2.0469 3.1439 2.6360 3.6180 2.6886 4.6704 4.1715 1.2562 1.2562 1.4503 1.4457 5.0814 1.4340 5.9921 2.5674 3.0297 2.9468 1.3417 1.3514 2.2725 2.1020 2.3130 1.6978 1.7093 1.2667 1.4774 1.4245 1.3901 1.8263 1.0625 1.8945 1.1377 1.6752 1.4887 1.4791 2.3531 1.3630 1.3050 1.3639 6.8495 8.9156 1.1756 2.2817 2.1351 1.0501 1.0526 2.1953 2.2101 8.2494 6.0379 6.6260 6.0552 6.1665 9.8196 1.0291 1.0843 1.1048 1.0863 1.0848 1.0853 1.0879 1.0880 1.0926 1.1051 1.0924 1.0964 1.0961 1.1015 1.1013
irintensity: 0.4716 0.3996 0.3555 0.2137 0.1387 1.6222 0.2282 0.7703 0.7391 1.7573 1.0736 0.0799 0.7243 5.2223 1.0162 6.9358 6.2324 4.6195 9.7565 0.0713 0.0217 1.8966 3.5818 12.5588 56.8998 28.2043 24.8770 16.6023 5.5922 14.6309 2.2874 37.3804 33.5377 68.6485 8.1683 15.5416 9.2088 26.8727 14.9584 10.0496 0.3779 0.5100 1.9437 3.2932 62.3608 0.0206 30.4048 4.5272 1.9052 1.0731 1.1276 0.4997 5.6781 2.4818 19.0440 11.6366 3.7867 0.1496 61.3583 22.1313 24.8482 73.3309 1.7838 29.5479 4.8588 46.9954 43.5238 23.1167 142.8680 0.8576 4.7666 31.8402 0.5525 3.4789 18.1884 24.3109 9.2226 12.8891 10.0090 20.7971 2.7500 132.8020 2.7282 30.1454 4.2358 13.4872 205.0577 33.1983 0.3630 19.9622 3.5039 0.7052 0.1733 3.9800 6.1102 16.1441 12.9326 16.3837 22.6700 16.8457 19.7778 20.6509
temp: 298.150 k
press: 1.00000 atm
elementType: 35 8 8 8 6 6 6 6 6 6 6 6 6 6 6 6 6 6 6 6 6 1 1 1 1 1 1 1 1 1 1 1 1 1 1 1
symmnumber: 1
zpe: 720042.4 jmol-1
zpe.correction: 0.274250 hartree
zpe.thermalcorrener: 0.294314 hartree
zpe.thermalcorrenthalpy: 0.295258 hartree
zpe.thermalcorrgfe: 0.221574 hartree
zpe.sumelectzpe: -894.442416 hartree
zpe.sumelectthermal: -894.422351 hartree
zpe.sumelectthermalent: -894.421407 hartree
zpe.sumelectthermalfe: -894.495092 hartree
dipole: 2.0781 1.6192 4.7786
dipole: 5.4567
quadrupole: -121.3744 -124.1384 -125.6116
quadrupole: 2.0468 -4.5187 -7.7215
quadrupole: 2.3337 -0.4303 -1.9034 2.0468 -4.5187 -7.7215
hfenergy: -894.7166654 hartree
pointgroup: C01 [X(C17H15Br1O3)]
dipole: -0.9719037 -0.7300676 1.7695487 debye
polarizability: 212.7281129|9.6106926|221.9974033|-10.7982003|17.5905609|184.4406081 unknown
InChI: InChI=1S/C17H15BrO3/c1-21-17(20)14(12-8-4-2-5-9-12)15(18)16(19)13-10-6-3-7-11-13/h2-11,14-15H,1H3
charge 0 multiplicity 1
36 atoms
Br 0.072257 3.084297 -0.355952
O  2.499774 1.404914 1.477123
O  -0.8090 0.099201 -2.09296
O  3.754788 1.561709 -0.478743
C  1.525312 0.500239 -0.551638
C  0.162867 1.042131 -0.081461
C  1.600787 -1.018033 -0.291525
C  -1.014721 0.484841 -0.905263
C  2.708176 1.215774 0.10578
C  1.655719 -1.909177 -1.391487
C  1.605429 -1.543177 1.026933
C  -2.371007 0.39615 -0.277845
C  1.721716 -3.303593 -1.17857
C  1.665478 -2.938702 1.237876
C  1.725779 -3.82341 0.136698
C  -2.670041 0.925834 1.007476
C  -3.399435 -0.252647 -1.016689
C  -3.970202 0.804836 1.540825
C  -4.694724 -0.377272 -0.480232
C  -4.983702 0.150822 0.80188
C  3.599983 2.089049 2.200475
H  1.615099 0.676743 -1.635835
H  0.038996 0.930692 1.004131
H  1.631771 -1.508829 -2.410374
H  1.582865 -0.860928 1.883955
H  1.765943 -3.982271 -2.037472
H  1.670027 -3.334378 2.259777
H  -1.906756 1.456146 1.585979
H  -3.151953 -0.649046 -2.006876
H  1.775505 -4.905603 0.301074
H  -4.195318 1.222184 2.528039
H  -5.478916 -0.882056 -1.054501
H  -5.991907 0.05586 1.220367
H  3.754014 3.096875 1.780434
H  4.533108 1.508635 2.109683
H  3.261588 2.141791 3.244614
