program: Gaussian 09
title: 000235413
version: EM64L-G09RevD.01
frameworkgroup: C1[X(C15H11Br3O)]
method: RPBEPBE
basis: SDD
operation: Freq
keyword: #p
keyword: freq=noraman
keyword: PBEPBE/SDD
title: #p freq=noraman PBEPBE/SDD
converged: YES YES NO NO
title: Mulliken charges:
elementType: Br Br Br O C C C C C C C C C C C C C C C H H H H H H H H H H H
charge: 0.018320 0.072355 0.041142 -0.194776 -0.676915 -0.602624 0.573462 0.209071 0.343687 -0.391333 -0.347971 -0.320327 -0.336657 -0.220528 -0.228502 -0.234317 -0.197995 -0.185514 -0.211550 0.341652 0.317883 0.241508 0.237073 0.252928 0.284712 0.233164 0.230952 0.233664 0.258201 0.259235
chargesum: 0.00000
title: Mulliken charges with hydrogens summed into heavy atoms:
elementType: Br Br Br O C C C C C C C C C C C C C C C
charge: 0.018320 0.072355 0.041142 -0.194776 -0.335262 -0.284740 0.573462 0.209071 0.343687 -0.149826 -0.110898 -0.067399 -0.051945 0.012637 0.002449 -0.000653 0.060206 0.073721 -0.211550
polarizability: 2.75689237e+02 -1.36076747e+01 2.22572156e+02 2.08533373e+01 2.00719250e+01 1.66055876e+02
1716.lowfreq: -5.9428 -2.6602 -0.0003 -0.0002 -0.0001 3.9901 16.3072 19.9309 37.3071
frequency: 16.2457 19.7799 37.2904 43.1132 59.4504 67.1504 86.2597 104.2044 135.5687 147.2552 158.3711 200.6201 229.1172 238.7011 250.9420 266.4803 330.0859 398.6983 403.5274 442.7151 457.1095 490.0482 510.0368 538.2845 589.3869 614.7679 619.8783 627.7968 692.1142 698.6982 698.8718 748.0616 775.4157 806.2673 819.9330 831.8704 845.9544 857.0121 924.4779 961.0995 966.3177 975.2106 990.6391 994.8267 998.2204 999.2951 1025.8765 1060.0743 1066.8378 1091.0240 1116.1944 1141.1350 1155.4480 1175.2093 1191.2878 1192.6229 1200.9252 1225.3790 1265.6458 1296.5815 1318.4298 1350.4998 1368.7304 1387.3134 1397.5683 1443.4359 1470.3644 1480.6242 1551.5378 1582.2667 1591.8156 1594.8024 1608.0065 3098.3975 3115.6587 3125.1350 3132.5523 3143.0829 3152.1211 3154.0626 3156.8714 3168.9180 3174.8231 3178.2347
redmass: 8.7495 7.0044 5.1209 4.8428 7.1065 13.2639 9.9620 32.2610 12.0559 13.2530 6.5225 9.8886 7.1191 5.5677 7.3816 10.0572 5.7069 2.7691 2.8469 4.7869 5.0202 3.9390 5.2903 5.3185 5.4527 6.2949 6.9570 6.3314 4.3453 1.7984 4.6406 3.0918 2.2735 4.3417 3.5904 1.4402 1.2568 1.5896 1.4646 2.6131 1.8521 1.4375 5.5738 1.6628 2.2180 1.5266 2.2834 2.5792 2.7686 1.8896 1.3740 1.2474 1.1848 1.0633 1.1374 1.1383 1.7700 2.1190 2.5084 1.2867 1.3702 1.3807 4.3930 6.3316 3.8851 2.1508 2.3010 2.2505 8.7216 7.2996 5.9840 6.8931 6.0373 1.0861 1.0868 1.0863 1.0870 1.0919 1.0886 1.0965 1.0888 1.1016 1.0962 1.0975
irintensity: 0.2056 0.0934 0.1347 0.0139 0.1784 0.2099 2.0035 0.3866 3.2279 0.6431 3.6517 1.9774 0.1566 2.2222 1.9768 0.8565 22.6330 0.3244 0.1869 1.2739 6.6391 10.2714 23.7401 70.2601 71.6898 4.6895 7.0860 22.7164 6.2112 85.7900 23.0293 8.6918 11.0633 8.0553 5.4213 8.2770 0.1374 45.7831 0.1587 60.3897 21.7160 1.2018 2.6154 15.1752 18.2441 4.0126 2.5856 67.1253 8.2572 7.7828 9.8922 24.3041 11.1841 0.4114 4.7541 20.7736 16.3530 30.5593 174.6331 1.6126 27.9158 4.0599 21.2819 0.5140 27.1118 12.3578 24.9455 5.7976 152.0875 142.0025 0.2922 63.3370 0.9642 3.6007 0.5595 4.0367 0.0664 12.4403 5.1216 26.2156 0.3747 21.0375 5.2332 1.4307
temp: 298.150 k
press: 1.00000 atm
elementType: 35 35 35 8 6 6 6 6 6 6 6 6 6 6 6 6 6 6 6 1 1 1 1 1 1 1 1 1 1 1
symmnumber: 1
zpe: 559952.0 jmol-1
zpe.correction: 0.213274 hartree
zpe.thermalcorrener: 0.231552 hartree
zpe.thermalcorrenthalpy: 0.232496 hartree
zpe.thermalcorrgfe: 0.161074 hartree
zpe.sumelectzpe: -692.461159 hartree
zpe.sumelectthermal: -692.442881 hartree
zpe.sumelectthermalent: -692.441937 hartree
zpe.sumelectthermalfe: -692.513360 hartree
dipole: -1.8446 2.6704 -1.1467
dipole: 3.4421
quadrupole: -147.7942 -131.1137 -134.4997
quadrupole: 6.7858 2.6917 3.3890
quadrupole: -9.9916 6.6888 3.3028 6.7858 2.6917 3.3890
hfenergy: -692.6744333 hartree
pointgroup: C01 [X(C15H11Br3O1)]
dipole: -0.5207615 1.2307843 -0.2189463 debye
polarizability: 270.1813421|-25.3302897|222.3865708|15.7802168|26.7435581|171.7493555 unknown
InChI: InChI=1S/C15H11Br3O/c16-12-8-6-11(7-9-12)15(19)14(18)13(17)10-4-2-1-3-5-10/h1-9,13-14H
charge 0 multiplicity 1
30 atoms
Br 3.298198 -2.123832 -1.653476
Br 0.275272 -3.500226 -0.368001
Br -6.114576 0.846634 -0.333155
O  0.31527 -0.738537 1.862645
C  2.182128 -1.209404 -0.184694
C  0.692117 -1.4972 -0.415928
C  2.482101 0.275319 -0.175967
C  -0.18309 -0.900333 0.711577
C  -1.597164 -0.514827 0.40954
C  3.119577 0.842272 0.956123
C  2.122435 1.115975 -1.26228
C  -2.242709 -0.800573 -0.823821
C  -2.320494 0.174208 1.421911
C  3.390542 2.226986 1.004318
C  2.391022 2.499838 -1.21234
C  3.025399 3.060048 -0.078302
C  -3.577168 -0.404009 -1.046138
C  -3.65082 0.580972 1.212538
C  -4.265295 0.287249 -0.025792
H  2.524799 -1.695044 0.739791
H  0.373325 -1.185391 -1.42108
H  3.387825 0.200651 1.80256
H  1.666845 0.685047 -2.161758
H  -1.72984 -1.36004 -1.612367
H  -1.815775 0.382967 2.370561
H  3.883154 2.654247 1.884376
H  2.115278 3.139634 -2.057731
H  3.23759 4.134239 -0.041802
H  -4.073724 -0.63335 -1.992726
H  -4.200525 1.114581 1.992717
