program: Gaussian 09
title: 000235351
version: EM64L-G09RevD.01
frameworkgroup: C1[X(C10H13NO4)]
method: RPBEPBE
basis: SDD
operation: Freq
keyword: #p
keyword: freq=noraman
keyword: PBEPBE/SDD
title: #p freq=noraman PBEPBE/SDD
converged: YES YES NO NO
title: Mulliken charges:
elementType: O O O O N C C C C C C C C C C H H H H H H H H H H H H H
charge: -0.343653 -0.272909 -0.280772 -0.254078 -0.366737 0.136111 0.275043 0.237284 -0.377004 -0.360960 -0.203612 0.286795 -0.530837 -0.519614 -0.604068 0.241308 0.252435 0.224622 0.220568 0.227523 0.241523 0.234569 0.244614 0.227770 0.334464 0.230461 0.270678 0.228479
chargesum: 0.00000
title: Mulliken charges with hydrogens summed into heavy atoms:
elementType: O O O O N C C C C C C C C C C
charge: -0.343653 -0.272909 -0.280772 -0.254078 -0.032273 0.136111 0.275043 0.237284 -0.135697 -0.108525 0.021010 0.286795 0.158776 0.187339 0.125549
polarizability: 1.64422248e+02 -1.55283390e+00 1.48495554e+02 1.04808716e+01 8.15116004e-01 8.03824416e+01
1716.lowfreq: -5.5323 -3.2744 0.0005 0.0006 0.0008 4.6636 42.4028 46.0611 57.4493
frequency: 42.3708 45.9961 57.4188 82.1253 91.5477 102.6341 146.6019 155.5119 183.4102 200.2125 221.0733 246.0503 257.4807 274.4244 287.7763 337.2835 366.2548 419.3139 468.4812 508.2918 530.0199 589.0950 593.9129 597.8748 640.4297 672.9139 693.9801 729.9128 773.6990 803.7922 848.4004 863.6559 876.3082 950.2559 974.8404 1056.2301 1061.0526 1078.2244 1110.3107 1114.4591 1127.1105 1139.0180 1149.5987 1155.4095 1163.7966 1182.0914 1209.8508 1235.9596 1268.6912 1387.4125 1423.5910 1431.5923 1435.8878 1457.0175 1459.4264 1462.8018 1466.2243 1467.4121 1477.9936 1480.2673 1483.2875 1515.2320 1586.6292 1606.3676 1710.0947 2962.9875 2979.7445 2983.6373 3052.9802 3057.5598 3090.4117 3112.4108 3116.9785 3125.7386 3141.0471 3168.8858 3179.8462 3575.8236
redmass: 4.0798 3.7376 3.8807 4.0105 3.6010 1.1444 4.2170 3.5234 3.4360 1.7030 1.2134 4.3754 1.9018 2.8720 4.4126 5.8340 5.4452 5.4885 5.6404 4.5433 6.3912 4.0318 1.2145 4.2487 5.8684 6.4299 5.3158 2.4379 2.2556 5.8330 1.4405 6.2372 5.0024 1.2974 8.8438 3.3856 5.1738 2.6305 1.2469 1.2580 1.2838 2.3453 1.6236 1.3089 1.7493 1.2287 2.4628 1.9524 3.9275 9.6624 1.3503 1.1594 1.2803 1.5549 1.1346 1.6067 1.1687 1.5056 1.2652 1.0683 1.0490 1.3952 7.2234 7.4065 9.6335 1.0326 1.0354 1.0303 1.1040 1.1026 1.1040 1.0983 1.1040 1.0998 1.0870 1.0917 1.0980 1.0772
irintensity: 2.5220 3.4835 4.4095 11.8663 5.3073 0.6417 3.1934 1.8754 2.5007 0.5741 0.3971 2.2088 0.3288 2.4982 4.1857 1.8649 20.1643 9.8086 5.8922 1.0193 4.1758 5.9297 108.2330 0.5921 0.8027 11.0004 22.8397 28.4851 68.3819 0.3545 1.6250 6.8296 75.4170 1.4075 9.6072 154.9731 111.8421 203.8233 3.8564 0.1178 0.1550 172.6515 9.8261 15.6926 59.6350 20.5759 65.2103 103.4647 95.6354 7.5569 49.8539 27.6509 29.1553 191.8207 38.1038 66.4600 27.8562 21.2858 29.8717 16.1627 13.8146 112.8067 64.1222 102.9620 261.0043 66.4814 78.7664 57.2952 42.9985 34.8746 30.2781 4.6672 29.6919 21.7653 9.2107 9.9347 10.2107 41.1409
temp: 298.150 k
press: 1.00000 atm
elementType: 8 8 8 8 7 6 6 6 6 6 6 6 6 6 6 1 1 1 1 1 1 1 1 1 1 1 1 1
symmnumber: 1
zpe: 574712.6 jmol-1
zpe.correction: 0.218896 hartree
zpe.thermalcorrener: 0.234777 hartree
zpe.thermalcorrenthalpy: 0.235721 hartree
zpe.thermalcorrgfe: 0.174989 hartree
zpe.sumelectzpe: -743.344197 hartree
zpe.sumelectthermal: -743.328316 hartree
zpe.sumelectthermalent: -743.327372 hartree
zpe.sumelectthermalfe: -743.388104 hartree
dipole: -2.2418 2.4081 -1.3532
dipole: 3.5575
quadrupole: -70.2445 -74.2247 -94.0163
quadrupole: 6.0405 7.3102 -1.1541
quadrupole: 9.2507 5.2705 -14.5211 6.0405 7.3102 -1.1541
hfenergy: -743.5630933 hartree
pointgroup: C01 [X(C10H13N1O4)]
dipole: 0.5988569 1.1499358 0.5272662 debye
polarizability: 162.6625045|5.4807448|150.4618339|9.4383165|2.0640518|80.1759059 unknown
InChI: InChI=1S/C10H13NO4/c1-11-10(12)15-9-7(13-2)5-4-6-8(9)14-3/h4-6,11H,1-3H3
charge 0 multiplicity 1
28 atoms
O  0.886742 -0.256128 0.606272
O  -0.593929 1.94144 0.185227
O  -0.330487 -2.93392 0.154996
O  1.662959 0.265558 -1.583485
N  2.897672 0.76149 0.361419
C  -0.45722 -0.431668 0.178268
C  -1.270527 0.726163 0.013773
C  -1.017551 -1.723241 0.023986
C  -2.646999 0.598325 -0.274253
C  -2.407575 -1.846118 -0.242511
C  -3.203603 -0.698431 -0.386538
C  1.81932 0.291289 -0.342631
C  -1.361378 3.170087 -0.028292
C  1.104772 -3.00461 -0.184479
C  4.071101 1.336079 -0.299878
H  -3.280819 1.479583 -0.402509
H  -2.820498 -2.853148 -0.346624
H  -4.271748 -0.807625 -0.602434
H  -2.19078 3.256214 0.700387
H  -1.762894 3.216569 -1.058622
H  -0.642407 3.987487 0.128367
H  1.724736 -2.60598 0.635574
H  1.316967 -2.45435 -1.119359
H  1.301842 -4.079011 -0.323951
H  2.822498 0.760219 1.378887
H  4.192045 2.405641 -0.045999
H  3.924801 1.249869 -1.38825
H  4.993559 0.794613 -0.020442
