program: Gaussian 09
title: 000235321
version: EM64L-G09RevD.01
frameworkgroup: C1[X(C22H26O7)]
method: RPBEPBE
basis: SDD
operation: Freq
keyword: #pfreq=noraman
keyword: PBEPBE/SDD
title: #p freq=noraman PBEPBE/SDD
converged: NO YES NO NO
title: Mulliken charges:
elementType: O O O O O O O C C C C C C C C C C C C C C C C C C C C C C H H H H H H H H H H H H H H H H H H H H H H H H H H
charge: -0.271848 -0.268570 -0.430703 -0.291355 -0.284361 -0.282568 -0.286631 0.160487 -0.272626 -0.245577 -0.170566 -0.375249 -0.350263 0.466587 0.480723 -0.537366 -0.441926 -0.569781 -0.406975 0.219001 0.237913 -0.323534 -0.336012 0.207397 0.181421 -0.523010 -0.535235 -0.536246 -0.522014 0.266646 0.202270 0.226574 0.242116 0.243807 0.249477 0.221699 0.327026 0.270186 0.279253 0.241347 0.277495 0.238133 0.251279 0.228530 0.208412 0.258294 0.222899 0.221264 0.244978 0.242997 0.220928 0.227542 0.210968 0.228724 0.256043
chargesum: 0.00000
title: Mulliken charges with hydrogens summed into heavy atoms:
elementType: O O O O O O O C C C C C C C C C C C C C C C C C C C C C C
charge: -0.271848 -0.268570 -0.103677 -0.291355 -0.284361 -0.282568 -0.286631 0.160487 -0.005981 -0.043307 0.056007 0.110674 0.120913 0.466587 0.480723 -0.267180 -0.162673 -0.328433 -0.129480 0.219001 0.237913 -0.085401 -0.084732 0.207397 0.181421 0.172225 0.153905 0.155221 0.173721
polarizability: 3.93313478e+02 2.69253962e+00 2.53013066e+02 -2.92403185e+01 2.68318853e-01 1.67702593e+02
1716.lowfreq: -21.8944 -9.6571 -1.9131 -0.0006 0.0004 0.0011 5.8987 11.3313 16.4466
frequency: -20.9448 11.0131 16.4072 31.7091 33.3536 47.7037 70.5058 73.2848 80.9183 93.7335 95.3373 112.9349 123.7857 141.1384 161.3262 165.5227 178.1301 183.6249 200.7110 203.2512 211.2557 213.2162 248.4082 252.9340 255.0055 266.2385 286.5484 308.8939 313.1791 329.3369 346.8015 348.5705 368.6608 388.4086 411.5091 445.0731 455.2638 469.5495 485.6475 508.9075 536.1597 552.2942 559.8541 573.3560 589.0994 609.4308 616.0763 630.8098 690.4501 700.9332 712.2871 718.8190 734.0651 736.6129 763.2493 763.8260 793.5988 819.3874 844.9987 850.8669 858.2412 879.7898 893.2286 902.3889 917.8215 931.0494 937.9768 955.9190 957.9657 963.7340 973.8130 982.5996 989.9736 1004.8316 1013.1756 1028.1062 1067.0497 1074.6984 1086.8982 1108.6158 1109.9909 1110.1731 1111.2555 1112.2468 1112.5816 1119.3534 1145.3097 1148.6370 1154.8494 1156.2072 1162.1021 1163.5685 1174.4208 1192.8244 1202.4516 1209.0760 1215.2016 1248.1724 1253.2329 1256.1870 1260.6545 1273.5947 1276.0813 1294.4858 1310.2024 1320.8853 1330.7368 1343.3473 1370.2867 1378.0705 1380.9712 1398.9910 1404.3434 1426.3296 1431.9819 1441.0400 1444.8637 1456.1785 1456.4496 1467.3453 1467.3883 1467.5528 1472.5829 1474.5248 1482.0334 1482.2710 1483.4470 1494.9454 1499.6602 1579.8303 1584.8966 1611.9302 1616.5042 2869.3876 2935.9169 2959.3052 2962.2091 2971.2328 2972.9545 3014.4653 3015.7815 3036.6974 3047.0902 3051.3885 3078.6656 3080.2507 3080.8812 3095.8186 3123.0606 3124.1166 3124.7315 3125.6622 3136.3612 3148.5144 3151.4609 3154.9938 3178.0651 3179.6898 3533.8887
redmass: 4.3912 4.7154 4.5274 5.4544 3.6005 4.8146 2.5319 2.5298 3.8118 3.7578 3.6467 2.4018 3.2870 1.8607 2.9160 1.8581 2.5090 2.9256 2.8553 2.8166 3.7222 4.1940 1.7384 2.1619 2.8445 2.2260 2.8326 3.5699 4.8361 2.9585 2.1707 2.3674 3.3562 4.2432 4.6476 4.6277 4.0339 3.5294 4.1817 4.7302 5.7471 5.0815 5.9484 5.9626 5.3144 4.4787 6.2890 5.6529 3.5875 4.6863 5.2874 5.1607 3.4334 3.3981 3.9843 4.3842 3.6376 1.5606 1.5049 2.3488 2.2196 2.9033 5.0611 1.8800 2.8200 4.3153 2.6014 1.3882 7.1268 1.3718 5.2081 5.9261 6.4123 3.6634 3.6369 3.1406 2.9552 2.4477 3.4515 2.0552 1.9652 1.3938 1.2611 1.2479 1.2559 2.0018 1.4665 1.4430 1.3814 1.3755 1.1630 1.6963 1.3983 1.3211 1.9338 1.8001 1.3759 2.1334 1.5821 1.8108 1.4604 1.9286 1.5116 1.8506 1.4163 1.4043 1.8709 1.3814 1.6415 4.7758 4.7422 3.0038 2.3749 1.2087 1.2403 1.2943 1.3230 1.0718 1.0686 1.0533 1.0523 1.0795 1.0999 1.1224 1.0634 1.0823 1.0539 2.4669 2.7333 7.6516 7.8624 6.3901 6.7363 1.0820 1.0833 1.0328 1.0326 1.0355 1.0347 1.0581 1.0607 1.0876 1.1040 1.1040 1.1077 1.0961 1.0973 1.1053 1.0992 1.0998 1.1043 1.1044 1.0900 1.0913 1.0883 1.0885 1.0961 1.0948 1.0655
irintensity: 1.3018 1.6754 0.8923 1.6264 1.1621 0.6127 0.0181 10.7857 0.7179 1.2516 10.6884 0.2742 8.1896 2.7998 4.6786 2.3015 7.9441 0.1706 0.6003 2.3002 1.4672 1.9741 2.2522 0.4432 8.6077 1.1095 1.2854 6.2942 7.6639 26.2364 49.9400 85.8039 27.2174 3.6131 17.9892 6.0576 11.0531 4.4549 4.8207 5.3939 2.1620 1.7775 1.3252 5.1964 2.2601 3.1003 5.1334 10.1284 7.6634 33.9098 22.0192 9.5040 12.5013 4.1239 18.7413 4.8837 3.3957 36.1615 7.7666 9.2489 32.0451 12.4979 19.8339 29.0317 40.0364 14.8053 13.6936 6.6963 50.0894 0.2621 6.4568 200.1906 109.5583 42.9032 54.0140 5.7968 34.1520 29.4997 8.2678 95.1889 74.7257 32.7100 0.2781 4.1674 3.1175 1.1108 15.0467 5.8106 9.2239 7.4205 7.5647 24.7402 18.6219 37.3616 58.6002 38.8574 13.6391 168.4374 48.6262 92.2136 20.7488 74.6297 23.8657 56.6522 39.8854 13.6818 34.5885 8.8138 16.6720 29.6782 22.4658 12.9656 31.5509 3.6499 0.3791 22.4602 12.3311 9.3783 14.8221 17.9020 2.4650 14.5360 93.0878 79.6878 22.2935 11.6455 22.9021 156.3371 121.2943 18.9268 12.9930 14.0406 10.8410 62.7075 36.8078 58.6183 68.6538 104.6491 94.7468 60.6570 30.8414 11.5834 45.6393 44.4416 23.0486 39.5589 39.5425 9.4964 25.7164 24.0245 20.5659 18.4011 10.1776 3.5545 8.3751 5.8838 2.2886 4.0064 4.2797
temp: 298.150 k
press: 1.00000 atm
elementType: 8 8 8 8 8 8 8 6 6 6 6 6 6 6 6 6 6 6 6 6 6 6 6 6 6 6 6 6 6 1 1 1 1 1 1 1 1 1 1 1 1 1 1 1 1 1 1 1 1 1 1 1 1 1 1
symmnumber: 1
zpe: 1154137.3 jmol-1
zpe.correction: 0.439588 hartree
zpe.thermalcorrener: 0.467739 hartree
zpe.thermalcorrenthalpy: 0.468684 hartree
zpe.thermalcorrgfe: 0.378620 hartree
zpe.sumelectzpe: -1378.231370 hartree
zpe.sumelectthermal: -1378.203218 hartree
zpe.sumelectthermalent: -1378.202274 hartree
zpe.sumelectthermalfe: -1378.292338 hartree
dipole: 0.5235 -2.4890 1.9415
dipole: 3.1998
quadrupole: -134.6175 -149.9172 -181.4411
quadrupole: 29.8295 9.0642 -9.3118
quadrupole: 20.7078 5.4080 -26.1158 29.8295 9.0642 -9.3118
hfenergy: -1378.6709578 hartree
pointgroup: C01 [X(C22H26O7)]
dipole: 0.2640344 0.9149195 -0.8234274 debye
polarizability: 383.6156787|6.1819662|252.602998|54.028263|-5.4560189|177.810461 unknown
InChI: InChI=1S/C22H26O7/c1-24-16-7-5-13(9-18(16)26-3)20-15-11-28-21(22(15,23)12-29-20)14-6-8-17(25-2)19(10-14)27-4/h5-10,15,20-21,23H,11-12H2,1-4H3
charge 0 multiplicity 1
55 atoms
O  0.971582 -0.517562 -1.7831
O  -0.899341 -0.237187 1.430075
O  0.773665 2.485165 0.350855
O  5.735372 1.612018 1.483656
O  -6.422959 0.536998 -1.291357
O  6.691111 -1.05397 1.206084
O  -6.625747 -2.243435 -0.727226
C  0.575123 1.076491 -0.011934
C  -0.793985 0.789861 -0.705068
C  1.628659 0.574693 -1.045526
C  -1.738237 0.557276 0.507888
C  0.478952 0.301674 1.329592
C  -0.50673 -0.467909 -1.548692
C  2.963753 0.109744 -0.480404
C  -3.039168 -0.171822 0.226995
C  3.794402 1.033029 0.20244
C  3.403542 -1.221764 -0.634676
C  -4.115839 0.546809 -0.351667
C  -3.191877 -1.548065 0.501472
C  5.033491 0.640978 0.745878
C  -5.329716 -0.100493 -0.674687
C  4.644233 -1.631091 -0.095357
C  -4.412007 -2.192163 0.20128
C  5.463582 -0.717043 0.605842
C  -5.4872 -1.492984 -0.384426
C  7.154695 1.839501 1.142273
C  -6.269952 1.946781 -1.653992
C  7.110168 -2.456197 1.141895
C  -7.940227 -1.752883 -0.263429
H  -1.118567 1.64517 -1.323658
H  1.810689 1.420461 -1.753698
H  -1.946442 1.550888 0.963976
H  1.167194 -0.556578 1.380664
H  0.680897 1.000268 2.161817
H  -0.789496 -1.388507 -1.008552
H  -1.00572 -0.456218 -2.53222
H  0.879049 3.020391 -0.478176
H  3.485549 2.073205 0.351495
H  2.768488 -1.926857 -1.176801
H  -3.996493 1.617465 -0.552492
H  -2.371442 -2.091292 0.977487
H  4.961052 -2.671016 -0.220432
H  -4.559733 -3.255679 0.413488
H  7.478659 2.652079 1.810471
H  7.249798 2.16169 0.086614
H  7.754011 0.93104 1.31464
H  -5.431381 2.08932 -2.363121
H  -6.113193 2.580967 -0.75955
H  -7.216915 2.222569 -2.141043
H  8.058581 -2.496777 1.697697
H  7.27597 -2.781723 0.096447
H  6.365696 -3.118562 1.62399
H  -7.957455 -1.683526 0.841836
H  -8.659688 -2.514877 -0.600176
H  -8.175953 -0.771949 -0.706786
