program: Gaussian 09
title: 000020575
version: EM64L-G09RevD.01
frameworkgroup: C1[X(C8H16N)]
method: RPBEPBE
basis: SDD
operation: Freq
keyword: #p
keyword: freq=noraman
keyword: PBEPBE/SDD
title: #p freq=noraman PBEPBE/SDD
converged: NO YES NO NO
title: Mulliken charges:
elementType: N C C C C C C C C H H H H H H H H H H H H H H H H
charge: -0.087801 -0.113871 -0.128852 -0.526111 -0.397678 -0.496573 -0.458355 -0.588554 -0.591470 0.299836 0.296147 0.285366 0.264804 0.286138 0.270042 0.258419 0.282453 0.279039 0.230954 0.275250 0.270415 0.271500 0.274188 0.269405 0.275310
chargesum: 1.00000
title: Mulliken charges with hydrogens summed into heavy atoms:
elementType: N C C C C C C C C
charge: -0.087801 0.185966 0.167295 0.024059 0.158502 0.044299 0.051638 0.228610 0.227433
polarizability: 8.87475842e+01 1.27912554e-01 7.94282052e+01 -5.00681707e-01 -4.03036361e-01 7.75192977e+01
1716.lowfreq: -0.0007 -0.0006 0.0000 2.8739 18.7864 43.0254 130.2296 218.9694 246.3682
frequency: 130.2097 218.8859 246.3550 268.7344 326.5344 379.8730 391.8387 412.8738 449.9226 479.9606 532.8991 633.9780 722.8741 768.6381 803.7875 819.8574 860.8423 895.7288 914.4726 927.6938 939.5574 963.8986 967.3644 973.5293 993.6093 1045.6354 1060.2912 1097.4823 1104.0005 1128.1618 1138.6023 1171.7118 1196.8114 1204.3693 1220.8256 1235.4774 1265.8386 1276.4595 1298.3247 1300.3144 1309.8207 1323.9534 1334.1968 1421.9213 1447.8958 1461.3378 1462.3996 1474.2485 1477.7642 1481.0041 1485.2829 1497.0815 1508.8487 3024.3544 3025.2247 3027.6155 3039.7666 3043.2363 3047.2548 3086.0084 3097.3798 3103.7354 3106.2381 3116.4363 3120.6875 3133.6849 3137.3753 3154.9383 3158.1699
redmass: 2.4204 1.1057 1.6058 1.3750 1.9841 2.2857 2.4209 2.1006 2.5121 1.8120 3.5106 3.3481 4.1497 4.0204 1.2973 2.9978 2.5610 2.8043 2.6788 2.2263 2.1430 1.9557 2.0317 1.7464 1.9773 1.3457 1.4101 1.2644 1.2952 1.1553 1.1626 1.7632 1.6128 1.7042 1.7496 1.4494 1.5060 1.3521 1.7573 1.4151 1.5225 1.4617 1.3836 1.1359 1.1502 1.0538 1.0488 1.0795 1.0658 1.0515 1.0743 1.0629 1.0846 1.0463 1.0473 1.0350 1.0654 1.0596 1.0625 1.1022 1.0899 1.1026 1.0940 1.1059 1.1093 1.1055 1.1046 1.1035 1.1044
irintensity: 0.3342 0.0650 0.0529 0.0261 0.4099 0.6220 0.2128 0.3620 0.8400 0.1312 0.7834 1.2896 2.9506 4.9176 6.5285 1.9247 6.1214 15.6110 18.0538 10.2799 12.4273 5.8905 7.6507 1.7306 3.7702 1.4321 0.8112 1.7578 1.5471 1.5357 8.4214 2.9942 3.2610 0.8766 0.6851 0.4175 8.5923 2.3369 0.7035 0.9438 7.0617 2.0308 9.7768 12.5727 8.8913 6.6992 9.9183 48.5583 18.1011 20.8295 43.2719 22.4410 5.9929 14.9213 5.0892 6.1378 11.3152 9.5969 7.8995 4.2075 11.8037 17.1502 0.7034 10.4599 8.2771 0.1951 5.7830 5.2853 3.2179
temp: 298.150 k
press: 1.00000 atm
elementType: 7 6 6 6 6 6 6 6 6 1 1 1 1 1 1 1 1 1 1 1 1 1 1 1 1
symmnumber: 1
zpe: 609354.3 jmol-1
zpe.correction: 0.232091 hartree
zpe.thermalcorrener: 0.240402 hartree
zpe.thermalcorrenthalpy: 0.241346 hartree
zpe.thermalcorrgfe: 0.200130 hartree
zpe.sumelectzpe: -368.215495 hartree
zpe.sumelectthermal: -368.207185 hartree
zpe.sumelectthermalent: -368.206240 hartree
zpe.sumelectthermalfe: -368.247457 hartree
dipole: -2.5286 0.0841 0.0811
dipole: 2.5313
quadrupole: -40.1444 -46.8201 -47.9609
quadrupole: -0.5825 -0.5898 0.0342
quadrupole: 4.8308 -1.8450 -2.9858 -0.5825 -0.5898 0.0342
hfenergy: -368.4475863 hartree
pointgroup: C01 [X(C8H16N1)]
dipole: -0.9953595 -0.0195948 -0.0257871 debye
dipolederiv: -0.4812313 -0.0201717 -0.0123486 -0.0610283 -0.3469313 -0.0055293 -0.0073093 0.0207745 -0.3068038 0.4054979 -0.0421358 0.1725769 -0.0157419 0.110323 -0.0263152 0.2260885 -0.0140199 0.2831197 0.1123845 0.0006578 0.0093811 -0.0041058 0.0578719 -0.0018286 -0.0042013 -0.0231014 0.0272303 -0.0345748 -0.047339 -0.0113566 -0.0539023 -0.0091174 -0.0100712 -0.0179181 -0.0015752 -0.0396171 0.1594912 0.0670385 -0.0646606 0.0946143 0.1908798 -0.0927507 -0.122983 -0.0899523 0.2377952 -0.0419067 0.0424106 0.0078379 0.0638573 0.0099168 0.0243351 -0.0048859 0.0239045 0.004255 0.0550696 0.0350144 -0.0017097 0.0214958 0.0098833 0.0422119 0.008599 0.0248346 0.0594059 0.2442974 -0.0987214 -0.066349 -0.1355249 0.113694 0.028048 -0.1007576 0.0369181 0.1158744 0.0977671 0.0859339 0.020806 0.1231088 0.2647627 0.0433806 0.0213758 0.022878 0.0820564 -0.0311349 -0.02082 0.0904073 -0.012319 0.0803481 0.0267438 0.055476 0.0153535 -0.0087019 0.0430899 -0.0421083 0.0380522 -0.0362809 0.0107599 0.0731969 0.0301572 0.067947 0.0431339 -0.008402 -0.0124859 -0.0875902 0.0172426 0.1108473 0.0194597 -0.0683024 -0.0034609 0.0454625 0.0232143 0.1310541 0.0477152 0.0998424 -0.0527494 -0.022325 0.0326348 0.001692 0.075652 -0.0098087 0.0784974 -0.0175213 0.0688806 -0.0184779 0.0368703 0.024194 -0.0030696 0.0823182 0.0608638 -0.0250706 -0.0176847 -0.0421587 0.014937 -0.1073401 -0.011069 -0.0430118 0.0018628 0.0592395 -0.0903958 0.0246186 -0.0780367 -0.074963 -0.0153865 0.024744 -0.061656 0.0686954 0.015243 0.0146203 -0.0773024 -0.0136475 0.0989478 -0.0020191 -0.0470153 0.0263036 -0.0242282 -0.0990398 -0.0081419 -0.0016773 -0.0268585 0.0805427 0.0117744 -0.0481991 0.0059749 0.0736121 0.089546 -0.0340156 -0.0466447 0.0036258 0.0013814 -0.0882863 0.0033184 -0.0793016 -0.0787302 0.0822675 -0.0855112 -0.0300248 -0.0324907 -0.0019954 -0.0483093 -0.0039973 -0.0412161 0.0972121 0.0446077 0.0290267 -0.0267619 0.0170508 0.1124137 -0.016251 -0.0872376 0.0122932 -0.0141393 0.0722242 0.0039978 0.0312904 -0.0404489 0.0437011 0.0905155 0.0670252 0.0576664 0.0412833 0.112336 -0.0268247 0.0184753 -0.0333599 0.0682854 0.0101657 0.0484292 0.06209 -0.0205901 0.0149235 -0.0006479 -0.0763167 0.0540394 0.0700918 0.0505172 -0.0816568 0.0097381 0.0664726 0.0140351 0.0661383 0.0767876 0.0221464 0.0546466 -0.0208067 0.0634907 -0.0280033 0.0873688 unknown
polarizability: 88.7502283|-0.2693247|79.4813899|0.3916295|-0.2634076|77.4634689 unknown
InChI: InChI=1S/C8H16N/c1-9(2)6-7-3-4-8(9)5-7/h7-8H,3-6H2,1-2H3
charge 1 multiplicity 1
25 atoms
N  -1.025137 -0.075347 -0.053036
C  0.091974 -0.151874 1.065574
C  1.159277 0.842494 -0.677522
C  0.855674 1.171582 0.812659
C  -0.270437 0.647397 -1.232885
C  1.152242 -1.206221 0.666707
C  1.865932 -0.5454 -0.571002
C  -2.200614 0.761056 0.445999
C  -1.566741 -1.43343 -0.476798
H  -0.403204 -0.30281 2.036728
H  1.721487 1.603338 -1.237924
H  1.764673 1.227012 1.43201
H  0.274826 2.094884 0.968522
H  -0.783442 1.602529 -1.429667
H  -0.326973 0.008885 -2.128053
H  0.746654 -2.210446 0.469297
H  1.844449 -1.316822 1.519231
H  2.945784 -0.421408 -0.390171
H  1.755927 -1.138632 -1.495713
H  -1.835794 1.716567 0.846907
H  -2.886664 0.951621 -0.39401
H  -2.728647 0.204613 1.23631
H  -1.90062 -1.987057 0.414701
H  -2.419506 -1.273109 -1.155016
H  -0.790518 -2.004224 -1.002448
