program: Gaussian 09
title: 000235308
version: EM64L-G09RevD.01
frameworkgroup: C1[X(C13H14O4)]
method: RPBEPBE
basis: SDD
operation: Freq
keyword: #pfreq=noraman
keyword: PBEPBE/SDD
title: #p freq=noraman PBEPBE/SDD
converged: YES YES NO NO
title: Mulliken charges:
elementType: O O O O C C C C C C C C C C C C C H H H H H H H H H H H H H H
charge: -0.275705 -0.214782 -0.219600 -0.259315 -0.204343 -0.577429 -0.523811 0.414334 0.128935 0.059338 0.220483 -0.424768 -0.492888 0.332953 -0.364952 -0.504755 -0.536355 0.250945 0.256904 0.229205 0.242176 0.271986 0.235547 0.301820 0.244091 0.246275 0.242870 0.231674 0.220082 0.249124 0.219962
chargesum: 0.00000
title: Mulliken charges with hydrogens summed into heavy atoms:
elementType: O O O O C C C C C C C C C C C C C
charge: -0.275705 -0.214782 -0.219600 -0.259315 0.046602 -0.091321 -0.009649 0.414334 0.128935 0.059338 0.220483 -0.189221 -0.191068 0.332953 -0.120861 0.216063 0.152814
polarizability: 1.84228631e+02 -1.60552950e+01 1.50769596e+02 -1.65954129e+01 -1.69747766e+01 1.16973473e+02
1716.lowfreq: -11.0132 -4.8828 -0.0008 -0.0007 -0.0006 2.3368 18.4507 33.2969 57.2674
frequency: 18.3812 33.2954 57.2167 78.0053 96.3104 99.2264 150.4372 173.5564 181.0536 196.0960 231.3015 274.2505 296.4271 299.1184 349.7277 353.0703 375.7278 418.0544 469.6709 488.3244 493.8393 530.7548 558.5104 575.9014 598.8407 649.9896 685.7445 705.4654 728.6892 775.7802 815.9066 851.9086 856.4554 893.4845 912.2021 927.2919 948.5815 953.1861 994.1512 1020.5685 1032.7965 1088.6115 1111.3907 1113.9897 1127.9194 1137.4129 1148.3673 1158.4474 1163.0976 1198.0814 1201.2091 1223.5175 1229.6826 1250.4859 1276.7554 1320.6873 1339.7293 1345.2932 1389.4824 1419.4777 1422.0027 1428.1927 1435.9033 1452.1518 1457.3911 1464.6895 1467.3277 1472.5592 1489.1522 1571.1519 1589.7115 1629.1854 1640.7777 2957.8272 2967.5072 2984.1782 3004.1784 3005.4885 3045.3055 3066.7873 3081.4248 3107.9959 3124.4827 3127.6625 3149.2488 3162.1656 3167.2074
redmass: 5.8711 5.4196 5.4435 3.4712 1.2885 2.6730 3.8589 4.5750 5.1117 2.9209 1.1919 3.9150 3.5271 3.3194 4.1120 2.9074 6.0776 3.2879 5.1704 5.0091 5.3722 3.6408 4.2559 3.4160 5.3077 3.5990 5.2794 4.9917 4.0553 4.8651 1.4744 5.4680 3.9102 2.2894 2.8201 1.5266 2.7979 1.6163 5.6084 2.4005 2.6354 1.6732 1.2597 1.2667 3.1266 1.6612 1.4284 1.3752 1.4161 1.5834 1.4258 2.1974 1.8285 2.6537 1.9628 1.5557 1.6709 1.7164 4.6976 1.7097 1.2242 1.5450 1.2532 1.0498 1.1404 1.0527 1.0504 1.0964 2.4903 6.7932 10.0661 7.6599 9.9583 1.0333 1.0680 1.0675 1.0753 1.0358 1.1039 1.0928 1.0939 1.1046 1.0896 1.0986 1.1050 1.0940 1.0919
irintensity: 0.9430 1.4564 1.8635 3.1726 0.3469 0.1644 4.4678 1.2255 5.3758 5.2138 0.5191 8.2412 7.2988 6.8700 0.5794 10.7136 6.1050 0.7952 6.8922 3.5890 3.6184 17.4551 8.7387 3.2944 2.9316 1.5324 14.7688 2.2317 3.0759 8.8410 39.2507 3.9777 12.9404 11.3884 5.5777 17.7699 8.6731 2.2584 86.5016 11.7138 28.1981 5.5184 0.0849 0.5846 202.0908 29.2391 15.5162 48.3417 3.5389 13.5865 30.8843 22.3608 3.6310 93.6598 224.9930 3.6089 20.8689 17.7651 4.4209 76.4038 17.7340 19.4958 8.7512 13.5041 22.9365 12.8668 13.8346 45.2859 73.8400 54.8877 133.2690 17.8563 152.2172 67.7479 29.4768 13.5121 29.0433 31.3072 49.4488 10.6873 5.1377 24.8210 21.4880 14.6105 15.0776 12.5346 7.1532
temp: 298.150 k
press: 1.00000 atm
elementType: 8 8 8 8 6 6 6 6 6 6 6 6 6 6 6 6 6 1 1 1 1 1 1 1 1 1 1 1 1 1 1
symmnumber: 1
zpe: 639192.2 jmol-1
zpe.correction: 0.243455 hartree
zpe.thermalcorrener: 0.259607 hartree
zpe.thermalcorrenthalpy: 0.260551 hartree
zpe.thermalcorrgfe: 0.198157 hartree
zpe.sumelectzpe: -803.421680 hartree
zpe.sumelectthermal: -803.405529 hartree
zpe.sumelectthermalent: -803.404585 hartree
zpe.sumelectthermalfe: -803.466979 hartree
dipole: 0.2373 -5.6868 3.4769
dipole: 6.6697
quadrupole: -79.3092 -100.5547 -100.5446
quadrupole: -5.7572 -2.5721 8.6727
quadrupole: 14.1603 -7.0852 -7.0751 -5.7572 -2.5721 8.6727
hfenergy: -803.6651359 hartree
pointgroup: C01 [X(C13H14O4)]
dipole: -0.0704383 -2.3517706 -1.1618231 debye
polarizability: 183.0395018|15.2905815|154.0579051|-19.3957707|13.1092197|114.8742924 unknown
InChI: InChI=1S/C13H14O4/c1-16-10-4-3-8-5-9(13(15)17-2)6-12(14)11(8)7-10/h3-4,7,9H,5-6H2,1-2H3
charge 0 multiplicity 1
31 atoms
O  3.016821 -1.598922 0.163976
O  0.044624 3.01475 0.508927
O  2.653307 0.263235 1.510491
O  -3.92173 -0.077571 0.886101
C  2.285114 0.413399 -0.946061
C  1.212788 -0.386557 -1.734566
C  1.804647 1.859943 -0.706628
C  -0.13884 -0.342933 -1.038874
C  -0.520408 0.792838 -0.258624
C  0.405041 1.961218 -0.08935
C  2.646067 -0.267284 0.378029
C  -1.057436 -1.407381 -1.160003
C  -1.787478 0.84315 0.36579
C  -2.692941 -0.230034 0.22746
C  -2.326934 -1.366609 -0.541125
C  3.407497 -2.356681 1.378224
C  -4.893724 -1.167144 0.770294
H  3.21511 0.428786 -1.548492
H  1.544466 -1.429549 -1.871102
H  1.132443 0.065838 -2.744847
H  1.770822 2.389577 -1.681211
H  2.494467 2.421664 -0.054853
H  -0.77948 -2.291282 -1.746535
H  -2.059235 1.72251 0.957477
H  -3.009079 -2.214225 -0.657697
H  2.568171 -2.387125 2.092788
H  4.276572 -1.880131 1.862097
H  3.657417 -3.362713 1.013497
H  -5.19304 -1.331438 -0.283509
H  -5.764372 -0.83596 1.35465
H  -4.496575 -2.10977 1.195478
