program: Gaussian 09
title: 000235302
version: EM64L-G09RevD.01
frameworkgroup: C1[X(C8H8Cl2O2)]
method: RPBEPBE
basis: SDD
operation: Freq
keyword: #p
keyword: freq=noraman
keyword: PBEPBE/SDD
title: #p freq=noraman PBEPBE/SDD
converged: YES YES NO NO
title: Mulliken charges:
elementType: Cl Cl O O C C C C C C C C H H H H H H H H
charge: -0.049860 -0.046187 -0.290738 -0.437382 0.422669 -0.276733 -0.339596 -0.386373 -0.308064 -0.067419 -0.027947 -0.265763 0.234890 0.211198 0.209472 0.218952 0.281416 0.278750 0.284651 0.354064
chargesum: 0.00000
title: Mulliken charges with hydrogens summed into heavy atoms:
elementType: Cl Cl O O C C C C C C C C
charge: -0.049860 -0.046187 -0.290738 -0.083318 0.422669 0.169355 0.088828 -0.104957 -0.029314 -0.067419 -0.027947 0.018889
polarizability: 1.48788607e+02 -5.48459722e+00 1.35882034e+02 5.41567092e+00 -2.26906278e-01 5.48772475e+01
1716.lowfreq: -5.4680 -2.1250 -0.0028 -0.0020 -0.0012 3.1400 45.0838 53.4582 98.7866
frequency: 45.0722 53.4552 98.7776 128.8325 151.9350 175.7142 205.1245 235.0151 268.7314 288.8018 371.4605 405.4247 407.4845 443.2565 485.1880 515.8320 560.9626 610.4267 661.4222 752.6742 806.4750 836.7118 840.2817 863.7964 878.8733 931.1328 975.3901 991.8385 1049.3621 1084.2860 1087.7623 1101.2815 1187.7727 1217.6549 1229.0435 1248.0972 1334.3149 1358.2369 1377.7281 1384.8288 1421.5510 1432.6137 1456.8680 1458.2922 1566.0388 1602.0077 2970.7981 2979.0328 3045.0229 3085.1073 3188.8946 3190.8417 3195.9320 3563.4967
redmass: 7.1992 4.6562 4.0006 5.5918 8.0252 10.2172 4.7040 4.9267 2.6856 5.0792 9.0594 1.2945 7.1048 3.2878 3.3599 5.2312 4.8261 4.5662 2.2847 10.2593 3.2178 1.5365 1.4053 1.4918 2.6312 3.2385 5.5893 2.8777 3.0439 1.6397 1.6302 1.6492 1.2088 1.2363 4.2762 1.2173 1.1971 1.4429 3.1856 1.4930 3.3531 2.5121 1.1324 1.1574 7.7380 7.5267 1.0554 1.0683 1.1066 1.0972 1.0930 1.0921 1.0940 1.0658
irintensity: 0.8177 2.8943 1.4364 4.2683 2.2999 1.5415 0.0943 2.0040 3.7997 3.0955 0.9470 189.1340 8.6009 31.6052 0.8038 0.0176 1.9380 5.7124 20.8620 76.3392 25.3495 19.9234 29.0270 27.6355 26.2883 98.3526 3.2199 164.1365 55.8463 19.6597 8.9908 14.3712 17.6539 30.1016 97.3244 4.8600 12.4179 19.1697 37.3947 22.1426 44.6476 116.4897 0.9992 6.0880 161.2359 250.9566 29.2070 47.4489 42.1474 25.7966 0.7357 0.6723 2.7664 7.3884
temp: 298.150 k
press: 1.00000 atm
elementType: 17 17 8 8 6 6 6 6 6 6 6 6 1 1 1 1 1 1 1 1
symmnumber: 1
zpe: 375669.0 jmol-1
zpe.correction: 0.143085 hartree
zpe.thermalcorrener: 0.155121 hartree
zpe.thermalcorrenthalpy: 0.156065 hartree
zpe.thermalcorrgfe: 0.103218 hartree
zpe.sumelectzpe: -1379.298326 hartree
zpe.sumelectthermal: -1379.286290 hartree
zpe.sumelectthermalent: -1379.285346 hartree
zpe.sumelectthermalfe: -1379.338193 hartree
dipole: -1.1151 0.9470 -1.3518
dipole: 1.9919
quadrupole: -92.1666 -84.4748 -86.6330
quadrupole: -4.2547 7.7785 -1.1054
quadrupole: -4.4084 3.2834 1.1251 -4.2547 7.7785 -1.1054
hfenergy: -1379.4414112 hartree
pointgroup: C01 [X(C8H8Cl2O2)]
dipole: -0.4451039 0.4287732 -0.4818501 debye
dipolederiv: -0.2669422 -0.2388104 -0.0316918 -0.2749939 -0.689712 -0.0754214 -0.0365644 -0.0743828 -0.0729852 -0.3695717 0.3165636 0.0245584 0.3331162 -0.5965796 -0.0473808 0.0247577 -0.0462466 -0.0675209 -1.9765075 0.1761857 -0.0216923 0.1447791 -0.380956 -0.002373 -0.0325951 -0.0101389 -0.2905713 -0.4914133 -0.2228751 -0.072118 -0.3492216 -0.5236143 0.1683767 0.006771 0.1407754 -0.6259857 1.6962078 -0.0702839 0.0309035 0.2001789 0.2843674 0.025655 0.0873577 0.0151136 0.1347905 0.6992855 -0.2270465 0.0106493 -0.6284998 0.3412027 0.0083938 -0.0601214 0.0120222 0.3087514 0.3217022 0.0795393 -0.0145828 0.1655829 0.4241572 -0.1727309 -0.024125 -0.1151219 0.5358706 -0.6171102 0.1015537 0.0011644 0.3385481 -0.2556581 0.0028819 0.0241244 -0.0046211 -0.159947 -0.537337 -0.0525268 -0.0117373 -0.4043177 -0.3385385 -0.027219 -0.0553303 -0.014036 -0.1935499 0.6250407 0.1868846 0.0398014 0.3967912 1.1212542 0.1348048 0.0636104 0.1273534 -0.0094904 0.7749313 -0.3260672 -0.0082558 -0.436563 1.0128938 0.0986995 -0.0182681 0.10033 -0.0240149 -0.3153244 0.0725875 0.0034863 0.0174395 -0.6915554 -0.0611955 -0.0040962 -0.0579298 -0.1278366 -0.0079054 -0.0257265 -0.0615396 0.1122683 -0.0110663 -0.062485 -0.0296998 -0.1013412 -0.0703959 -0.0233126 -0.0533917 0.0739958 0.0983275 -0.0553685 0.0977221 0.0280567 0.1158609 -0.0615012 0.0707382 -0.0197028 0.0183788 -0.0840156 -0.0080917 -0.084872 -0.0225246 -0.0391878 -0.1890721 -0.0419651 0.0958413 -0.004277 0.0895764 -0.0482241 0.0449625 0.0444989 0.0048287 0.0768002 0.0930344 -0.042892 -0.0077783 -0.0446014 0.035999 -0.0174463 -0.0086015 -0.0160808 0.1802398 0.0689891 0.066967 0.0005422 0.0833583 0.0354505 -0.0134372 0.0049571 -0.0128768 0.1761318 0.0261623 -0.0084946 -0.0068203 -0.0059276 0.1061308 -0.0089236 -0.0060604 -0.0088133 0.1850117 0.2712977 0.1916947 0.0370132 0.2481742 0.2379088 -0.0080117 0.013853 -0.015507 0.2952754 unknown
polarizability: 148.6386119|-6.0828103|135.8211801|1.2025315|6.3241974|55.0880963 unknown
InChI: InChI=1S/C8H8Cl2O2/c9-6-3-7(10)5-8(4-6)12-2-1-11/h3-5,11H,1-2H2
charge 0 multiplicity 1
20 atoms
Cl 2.50258 2.856154 0.289308
Cl 3.010961 -2.646329 -0.280556
O  -1.61649 -0.379063 -0.210469
O  -4.225465 -0.620632 1.011286
C  -0.239073 -0.155013 -0.132926
C  -2.525951 0.785608 -0.111563
C  -3.93728 0.203859 -0.16184
C  0.570559 -1.31613 -0.227218
C  0.343622 1.127885 0.024326
C  1.747962 1.21028 0.086155
C  1.962465 -1.163608 -0.159013
C  2.593008 0.089941 -0.001313
H  -2.355436 1.306345 0.850916
H  -2.342685 1.479365 -0.957187
H  -4.067782 -0.369254 -1.103125
H  -4.67646 1.022048 -0.136618
H  0.1017 -2.294578 -0.352101
H  -0.259536 2.034722 0.096888
H  3.679262 0.183242 0.049452
H  -3.547163 -1.342443 1.0515
