program: Gaussian 09
title: 000235295
version: EM64L-G09RevD.01
frameworkgroup: C1[X(C9H12N4O3)]
method: RPBEPBE
basis: SDD
operation: Freq
keyword: #p
keyword: freq=noraman
keyword: PBEPBE/SDD
title: #p freq=noraman PBEPBE/SDD
converged: YES YES NO NO
title: Mulliken charges:
elementType: O O O N N N N C C C C C C C C C H H H H H H H H H H H H
charge: -0.278672 -0.266246 -0.434837 -0.175557 -0.160313 -0.221448 -0.094360 0.142023 0.083195 0.195832 0.150035 0.203969 -0.646470 -0.442708 -0.614383 -0.600393 0.240619 0.271617 0.290929 0.229372 0.243425 0.272264 0.247132 0.245476 0.268594 0.251655 0.250790 0.348461
chargesum: 0.00000
title: Mulliken charges with hydrogens summed into heavy atoms:
elementType: O O O N N N N C C C C C C C C C
charge: -0.278672 -0.266246 -0.086376 -0.175557 -0.160313 -0.221448 -0.094360 0.142023 0.083195 0.195832 0.150035 0.203969 0.156696 0.030089 0.150487 0.170645
polarizability: 1.88922014e+02 4.80275236e-01 1.49592170e+02 -3.94363717e+00 7.84516306e-01 7.66649515e+01
1716.lowfreq: -2.8414 -0.0008 -0.0006 0.0005 3.7722 8.4546 52.2573 71.0131 86.1071
frequency: 52.2473 71.0061 86.0983 94.9529 105.1633 114.0416 121.7940 132.3778 168.5708 195.9514 241.0077 251.3375 277.5929 297.7117 339.5327 354.7318 375.3095 385.2875 391.5448 412.5533 445.2362 493.2178 523.4395 620.8033 656.0565 685.6349 704.0379 722.1223 746.5635 771.0045 786.8283 912.7463 943.5603 960.0941 971.0299 1030.7655 1054.0267 1129.5503 1131.2098 1131.8385 1134.3852 1172.6684 1193.2561 1215.8190 1228.6255 1267.7262 1298.8802 1307.9446 1359.7057 1369.8721 1394.3013 1414.9344 1425.8399 1441.7472 1457.0144 1463.0725 1472.9986 1476.0677 1478.4162 1479.2579 1483.0195 1495.7509 1508.3269 1572.0302 1613.2982 1646.5866 3000.7376 3007.3848 3013.3271 3020.6505 3088.4420 3096.5256 3096.7068 3105.3372 3133.9063 3139.5860 3140.0617 3557.9429
redmass: 4.1498 3.5369 1.1181 2.3554 1.5524 2.5958 1.1753 3.2538 5.2112 3.1924 5.2701 2.5062 4.2301 3.2341 4.9470 3.3801 2.5707 2.4386 5.8029 4.1373 7.9112 5.6381 6.2543 4.7073 10.1806 9.4217 10.9063 6.7437 11.3014 5.0778 5.3238 3.5590 2.4178 5.0884 2.6272 2.7478 2.9406 1.3032 1.3228 1.3009 1.4525 1.6786 3.2368 5.8493 2.6097 5.8998 6.4734 1.4089 2.2894 1.4740 2.1414 1.3079 1.2744 2.3126 1.2332 1.8246 1.0559 1.1411 1.0608 1.1156 1.1856 1.3510 2.2543 7.9382 10.7134 9.8510 1.0357 1.0336 1.0328 1.0596 1.1049 1.1024 1.0993 1.1021 1.1038 1.1012 1.1024 1.0666
irintensity: 1.7864 0.7761 0.1074 0.5022 0.9571 0.3242 0.5813 19.4553 0.0757 7.0437 0.7197 16.0285 0.4648 5.1501 7.0043 20.0649 123.5852 50.6110 2.0625 43.5262 13.8749 10.8354 7.2648 11.0514 2.0751 3.5835 9.0945 7.1929 12.2358 8.6403 8.4384 76.6553 6.3466 47.3821 6.9618 88.8403 12.6541 0.5579 3.7471 0.0552 20.4079 12.3439 52.3247 23.7892 3.9052 51.7020 51.4909 21.9769 17.1650 19.0397 21.9496 17.5765 62.6927 112.5200 76.1351 16.4594 17.1258 37.8420 23.2989 7.6443 21.3266 42.5595 75.3987 11.8182 639.3695 373.1885 32.6630 34.1019 26.9111 35.6288 11.6173 15.6697 9.5494 16.9777 0.8754 0.4140 0.8178 11.5170
temp: 298.150 k
press: 1.00000 atm
elementType: 8 8 8 7 7 7 7 6 6 6 6 6 6 6 6 6 1 1 1 1 1 1 1 1 1 1 1 1
symmnumber: 1
zpe: 566196.9 jmol-1
zpe.correction: 0.215653 hartree
zpe.thermalcorrener: 0.231570 hartree
zpe.thermalcorrenthalpy: 0.232514 hartree
zpe.thermalcorrgfe: 0.172386 hartree
zpe.sumelectzpe: -793.674954 hartree
zpe.sumelectthermal: -793.659036 hartree
zpe.sumelectthermalent: -793.658092 hartree
zpe.sumelectthermalfe: -793.718221 hartree
dipole: 2.7553 0.9610 -0.2947
dipole: 2.9330
quadrupole: -101.9311 -96.0071 -89.4330
quadrupole: 3.1681 -1.4222 2.2430
quadrupole: -6.1407 -0.2167 6.3573 3.1681 -1.4222 2.2430
hfenergy: -793.8906067 hartree
pointgroup: C01 [X(C9H12N4O3)]
dipole: 1.124104 -0.2124062 0.1509779 debye
polarizability: 188.3527165|5.1998389|148.9355043|3.2875727|-9.4455938|77.8909146 unknown
InChI: InChI=1S/C9H12N4O3/c1-11-5(4-14)10-7-6(11)8(15)13(3)9(16)12(7)2/h14H,4H2,1-3H3
charge 0 multiplicity 1
28 atoms
O  -1.174288 2.617461 -0.399989
O  -3.343163 -1.539947 0.106761
O  4.366528 0.23942 -0.903424
N  1.476548 1.026503 0.077659
N  -1.002549 -1.525625 0.278344
N  -2.235092 0.513324 -0.129046
N  1.452511 -1.238003 0.40798
C  0.134317 0.62262 0.04356
C  0.158598 -0.767888 0.251758
C  2.231756 -0.118119 0.302399
C  -1.078936 1.368949 -0.179639
C  -2.255663 -0.896758 0.089063
C  1.98646 2.403014 -0.0798
C  3.728259 -0.124236 0.382697
C  -0.941399 -2.982687 0.50309
C  -3.563073 1.138402 -0.331694
H  2.225649 2.841984 0.905237
H  2.893316 2.381271 -0.704308
H  1.202371 3.012839 -0.552366
H  4.102356 0.640305 1.083729
H  4.046027 -1.122892 0.733398
H  -1.973174 -3.362682 0.499309
H  -0.459169 -3.195568 1.471725
H  -0.354602 -3.465602 -0.296267
H  -3.400194 2.21739 -0.467339
H  -4.205831 0.948169 0.542907
H  -4.052959 0.707548 -1.220205
H  4.142696 -0.45489 -1.574737
