program: Gaussian 09
title: 000235291
version: EM64L-G09RevD.01
frameworkgroup: C1[X(C9H12N4O3)]
method: RPBEPBE
basis: SDD
operation: Freq
keyword: #p
keyword: freq=noraman
keyword: PBEPBE/SDD
title: #p freq=noraman PBEPBE/SDD
converged: YES YES NO NO
title: Mulliken charges:
elementType: O O O N N N N C C C C C C C C C H H H H H H H H H H H H
charge: -0.259327 -0.263361 -0.265226 -0.164039 -0.220176 -0.389549 -0.064854 0.123925 0.080083 0.133483 0.154154 0.206506 -0.395795 -0.614796 -0.598491 -0.509580 0.353167 0.228413 0.252653 0.272908 0.246034 0.246891 0.268322 0.250928 0.251195 0.242321 0.214144 0.220067
chargesum: 0.00000
title: Mulliken charges with hydrogens summed into heavy atoms:
elementType: O O O N N N N C C C C C C C C C
charge: -0.259327 -0.263361 -0.265226 -0.164039 -0.220176 -0.036382 -0.064854 0.123925 0.080083 0.133483 0.154154 0.206506 0.085271 0.151037 0.171953 0.166953
polarizability: 1.86167342e+02 -3.41142648e+00 1.45182387e+02 7.19334732e+00 2.97031374e-01 7.92304736e+01
1716.lowfreq: -2.5138 0.0001 0.0008 0.0010 6.2178 7.1966 37.0733 58.0834 88.7908
frequency: 37.0230 58.0827 88.7829 96.1042 112.0440 119.9029 126.1596 138.8730 187.7117 191.1552 230.5461 252.7343 302.5486 313.3084 347.6037 361.6226 368.9870 394.2508 398.2498 474.5453 488.8339 537.5049 636.8007 664.7851 680.2947 704.8644 732.1842 740.0812 748.4736 767.6610 849.6630 927.5063 964.1942 983.7606 999.7379 1040.3960 1041.5051 1105.7930 1116.4427 1129.7866 1132.0963 1150.9570 1184.5524 1206.2096 1227.3405 1230.1781 1263.2366 1295.9147 1320.8848 1374.7089 1392.5158 1418.3384 1428.0009 1436.5118 1450.1375 1460.1950 1464.6797 1473.3407 1473.4687 1478.5994 1479.9814 1482.3592 1524.0244 1578.9835 1615.9186 1658.1786 2947.7362 2989.0686 3007.3227 3012.5382 3030.5282 3057.8657 3096.5591 3104.8769 3117.4432 3138.2646 3139.2624 3578.5445
redmass: 3.9967 3.6601 1.9229 1.4298 2.0016 1.5553 2.5545 3.8830 1.6495 4.0203 4.1239 3.3976 3.4417 4.9532 4.8968 3.0932 7.2798 5.7560 3.3580 7.4143 8.6651 6.1021 6.3387 7.4671 9.2517 11.0073 1.1876 5.0118 7.4310 4.8931 5.2474 4.1893 3.3286 4.3031 2.2556 3.1178 4.2608 3.7465 1.2628 1.3030 1.2999 1.4474 2.9075 1.9162 2.5524 1.3661 5.2789 5.0335 1.5786 4.4900 2.8741 1.2910 1.3028 1.1479 1.2085 1.0576 2.1271 1.0518 1.0484 1.0757 1.0505 1.4385 4.1201 8.2842 10.5610 10.5075 1.0332 1.0598 1.0336 1.0327 1.1034 1.1031 1.1026 1.1022 1.0991 1.1025 1.1011 1.0819
irintensity: 2.0994 0.3260 1.0497 0.8478 2.9793 1.5657 5.9835 0.3199 2.4550 15.0241 12.1221 22.0922 5.1229 1.6037 19.3744 3.4366 0.4528 21.3097 1.8219 11.5187 15.9057 3.2209 1.3459 2.6708 2.0172 8.3107 113.7334 9.4345 1.4771 0.5056 13.6047 4.8624 34.5539 5.8725 19.2218 38.3847 86.0806 11.8953 1.0918 0.3158 0.1225 14.2818 10.4865 110.6196 7.2201 7.8746 27.0464 135.1566 12.1913 36.7600 24.5348 33.8264 63.7203 4.3563 28.9990 14.3372 75.5542 6.8278 22.0774 5.1393 18.4731 77.6760 64.1790 3.4645 603.5059 407.5402 50.5414 34.1606 35.6919 26.4602 64.0226 8.8465 18.0649 17.1184 23.7376 0.7424 0.3994 98.6926
temp: 298.150 k
press: 1.00000 atm
elementType: 8 8 8 7 7 7 7 6 6 6 6 6 6 6 6 6 1 1 1 1 1 1 1 1 1 1 1 1
symmnumber: 1
zpe: 567519.4 jmol-1
zpe.correction: 0.216157 hartree
zpe.thermalcorrener: 0.231733 hartree
zpe.thermalcorrenthalpy: 0.232677 hartree
zpe.thermalcorrgfe: 0.172780 hartree
zpe.sumelectzpe: -793.667327 hartree
zpe.sumelectthermal: -793.651751 hartree
zpe.sumelectthermalent: -793.650807 hartree
zpe.sumelectthermalfe: -793.710703 hartree
dipole: -3.4702 1.4600 0.6767
dipole: 3.8252
quadrupole: -95.8237 -99.5293 -89.6744
quadrupole: -3.7962 -5.1375 -1.7701
quadrupole: -0.8146 -4.5202 5.3348 -3.7962 -5.1375 -1.7701
hfenergy: -793.8834837 hartree
pointgroup: C01 [X(C9H12N4O3)]
dipole: 1.4080316 -0.5265678 0.0708136 debye
polarizability: 184.2929781|0.6885345|143.8922447|-16.5543602|8.1779866|82.3949802 unknown
InChI: InChI=1S/C9H12N4O3/c1-12-7-6(8(14)13(2)9(12)15)10-5(11-7)4-16-3/h10H,4H2,1-3H3
charge 0 multiplicity 1
28 atoms
O  4.351067 0.782775 -0.460679
O  -0.960004 2.753502 0.198301
O  -3.407389 -1.281144 0.395161
N  -1.124128 -1.433771 -0.126887
N  -2.172031 0.709087 0.28736
N  1.473473 0.953276 -0.516425
N  1.301547 -1.31275 -0.646388
C  0.138876 0.644897 -0.243896
C  0.06451 -0.753577 -0.339637
C  -0.978225 1.489697 0.087422
C  2.135885 -0.240359 -0.748977
C  -2.298929 -0.708891 0.195311
C  3.592104 -0.281457 -1.127898
C  -1.178233 -2.904603 -0.233625
C  -3.418577 1.433868 0.626985
C  4.588448 0.502447 0.964048
H  1.895851 1.882809 -0.517415
H  3.991773 -1.290186 -0.903713
H  3.726164 -0.080842 -2.206176
H  -2.210592 -3.215389 -0.017657
H  -0.482674 -3.362192 0.489613
H  -0.890113 -3.221837 -1.249872
H  -3.172368 2.5049 0.66972
H  -3.80588 1.085903 1.598386
H  -4.187541 1.243581 -0.139398
H  5.171328 1.355597 1.342953
H  5.168985 -0.433352 1.091521
H  3.638672 0.420011 1.530864
