program: Gaussian 09
title: 000235276
version: EM64L-G09RevD.01
frameworkgroup: C1[X(C10H11N5O4)]
method: RPBEPBE
basis: SDD
operation: Freq
keyword: #p
keyword: freq=noraman
keyword: PBEPBE/SDD
title: #p freq=noraman PBEPBE/SDD
converged: YES YES NO NO
title: Mulliken charges:
elementType: O O O O N N N N N C C C C C C C C C C H H H H H H H H H H H
charge: -0.259892 -0.221702 -0.190839 -0.243074 -0.408218 -0.456809 0.099907 -0.030000 -0.620291 0.407508 0.048900 -0.143824 -0.623122 0.087531 -0.001004 0.169599 0.286197 -0.261615 -0.662620 0.268349 0.284569 0.330426 0.306059 0.224263 0.234813 0.314569 0.363996 0.215765 0.251974 0.228584
chargesum: 0.00000
title: Mulliken charges with hydrogens summed into heavy atoms:
elementType: O O O O N N N N N C C C C C C C C C C
charge: -0.259892 -0.221702 -0.190839 -0.243074 -0.077792 -0.150750 0.099907 -0.030000 0.058274 0.407508 0.048900 -0.143824 -0.070204 0.087531 -0.001004 0.169599 0.286197 0.197461 0.033703
polarizability: 2.44032743e+02 1.09358740e+01 1.58556884e+02 2.68775431e+01 -1.26963042e+01 9.96877775e+01
1716.lowfreq: -6.4081 -1.7070 0.0005 0.0008 0.0009 7.1303 16.7616 28.5963 46.2094
frequency: 16.5344 28.5938 46.1999 59.2975 84.6922 98.3635 103.9231 140.0665 192.2504 196.1952 199.9919 213.3977 237.4205 249.4504 275.1155 312.9625 329.0194 381.4157 386.1358 403.8516 439.7362 466.2490 487.5198 514.8810 535.6893 549.4700 564.2309 577.2311 631.4751 650.2025 654.4327 681.7574 688.8770 704.5189 750.7802 757.4627 783.2639 807.2738 809.9177 835.5440 893.9123 933.9792 956.0210 995.0626 1015.3311 1095.4400 1097.1087 1130.1032 1157.4026 1160.3069 1172.2313 1192.5908 1257.6262 1274.9123 1278.1262 1296.9300 1321.8254 1348.0875 1356.3753 1391.3388 1400.1623 1417.3234 1457.6043 1463.8556 1485.3597 1498.9712 1527.7111 1569.6490 1602.0626 1609.1679 1628.3157 1642.4939 1662.7253 2992.9658 3022.9830 3030.4383 3088.0406 3090.9976 3093.9203 3119.9063 3489.6468 3510.4451 3549.2834 3699.7929
redmass: 5.0658 5.5798 4.0386 5.6086 3.9426 4.3209 8.6098 3.7561 2.6584 5.0911 1.5980 2.4337 2.9999 2.0856 3.6929 3.0798 4.9639 6.9176 5.6734 4.1079 5.0807 3.8206 1.3868 4.0981 8.3837 1.1723 5.3874 4.9405 5.6092 7.5285 6.7649 3.3842 7.9651 2.0220 5.1864 4.2270 5.7461 1.6504 4.1797 4.0108 3.6028 3.0368 2.8185 3.1713 2.9509 2.2656 3.7446 3.8086 1.6755 4.4758 1.6302 3.9080 1.8702 2.1429 1.1523 2.8593 2.4354 2.1700 1.3123 1.2328 4.9585 1.1625 1.0916 1.0447 1.0518 6.3872 5.8007 4.1185 1.8059 3.6720 5.3508 8.2386 4.4162 1.0362 1.0600 1.0596 1.0973 1.1003 1.1033 1.1061 1.0775 1.0781 1.0457 1.1052
irintensity: 1.5456 11.6214 0.4008 1.4555 4.3872 1.0446 2.7408 0.8208 1.4698 3.3744 34.7049 7.9451 7.8075 2.6804 5.0964 22.3571 0.5091 2.1577 15.1657 4.1508 1.6966 35.7498 201.3441 4.4704 4.6504 115.9068 5.3211 11.3399 15.0171 12.0097 15.8668 21.4917 37.4152 67.7493 10.2843 18.7826 25.8782 4.2767 2.3420 18.7497 12.0418 15.3204 15.4768 57.9240 76.3451 63.6673 2.6032 453.2637 19.7869 2.0970 7.2538 32.8412 28.3524 21.4420 1.2074 32.8961 212.1397 20.0699 7.7101 21.4389 343.1980 34.7374 11.7958 13.5315 12.2911 112.6344 35.7814 15.4021 156.4991 517.7774 719.6212 77.3063 358.6416 19.8162 5.2541 30.4468 36.4853 0.9752 0.6728 34.4215 29.5218 11.4910 142.9714 47.6108
temp: 298.150 k
press: 1.00000 atm
elementType: 8 8 8 8 7 7 7 7 7 6 6 6 6 6 6 6 6 6 6 1 1 1 1 1 1 1 1 1 1 1
symmnumber: 1
zpe: 573154.3 jmol-1
zpe.correction: 0.218303 hartree
zpe.thermalcorrener: 0.236373 hartree
zpe.thermalcorrenthalpy: 0.237317 hartree
zpe.thermalcorrgfe: 0.170176 hartree
zpe.sumelectzpe: -960.954678 hartree
zpe.sumelectthermal: -960.936609 hartree
zpe.sumelectthermalent: -960.935664 hartree
zpe.sumelectthermalfe: -961.002805 hartree
dipole: 4.3007 -7.2111 2.9926
dipole: 8.9136
quadrupole: -62.4783 -122.7565 -109.7196
quadrupole: -35.4410 12.6584 -0.7827
quadrupole: 35.8398 -24.4384 -11.4015 -35.4410 12.6584 -0.7827
hfenergy: -961.1729814 hartree
pointgroup: C01 [X(C10H11N5O4)]
dipole: -1.8017754 -2.3131439 -1.9238163 debye
polarizability: 243.1237884|-21.4243541|148.1109798|21.9361908|26.2621104|111.0426359 unknown
InChI: InChI=1S/C10H11N5O4/c1-2-19-5(16)3-4-8(17)13-7-6(12-4)9(18)15-10(11)14-7/h13-14H,2-3,11H2,1H3
charge 0 multiplicity 1
30 atoms
O  4.441723 -0.282812 0.507705
O  1.105409 -2.813624 -0.142134
O  -2.075775 2.454318 1.640002
O  2.778061 -0.000906 -1.107062
N  -0.982495 -1.787987 -0.3890
N  -3.148525 -0.798446 -0.647857
N  -0.102811 0.414916 1.063593
N  -3.672077 1.344331 0.335109
N  -5.277254 0.204517 -0.928289
C  -1.851958 -0.744771 -0.144991
C  0.746329 -0.578074 0.812347
C  -1.413317 0.356848 0.611534
C  2.179912 -0.460494 1.259944
C  0.372654 -1.80874 0.079412
C  -2.370552 1.468172 0.920256
C  -4.012608 0.295358 -0.383868
C  3.118974 -0.225327 0.075494
C  5.493993 -0.032839 -0.528617
C  5.755504 1.467591 -0.684012
H  2.517867 -1.373157 1.782553
H  2.270141 0.390559 1.956323
H  -1.261567 -2.614286 -0.930311
H  -3.467462 -1.609424 -1.183476
H  6.372322 -0.570054 -0.136828
H  5.161332 -0.485411 -1.479183
H  -5.584169 -0.547283 -1.539684
H  -5.902656 0.983933 -0.73493
H  6.589111 1.628385 -1.39285
H  4.863832 1.982158 -1.079386
H  6.032161 1.921947 0.282906
