program: Gaussian 09
title: 000235269
version: EM64L-G09RevD.01
frameworkgroup: C1[X(C6H3IN2O4)]
method: RPBEPBE
basis: SDD
operation: Freq
keyword: #p
keyword: freq=noraman
keyword: PBEPBE/SDD
title: #p freq=noraman PBEPBE/SDD
converged: NO NO NO NO
title: Mulliken charges:
elementType: I O O O O N N C C C C C C H H H
charge: 0.190593 -0.178632 -0.178633 -0.184362 -0.184362 0.026326 0.026319 0.436240 0.436262 -0.481113 -0.288495 -0.288512 -0.302769 0.341469 0.314836 0.314834
chargesum: 0.00000
title: Mulliken charges with hydrogens summed into heavy atoms:
elementType: I O O O O N N C C C C C C
charge: 0.190593 -0.178632 -0.178633 -0.184362 -0.184362 0.026326 0.026319 0.436240 0.436262 -0.139644 0.026341 0.026323 -0.302769
polarizability: 1.83926038e+02 -5.98139412e-04 1.41786127e+02 6.76830264e-03 1.10052894e-02 3.77615025e+01
1716.lowfreq: -12.9310 -8.2936 -0.0008 -0.0008 -0.0006 3.1834 52.5900 53.8639 99.7308
frequency: 52.5700 53.8350 99.7254 107.9701 134.4128 187.8569 188.6320 229.5218 308.2467 338.3051 399.5043 461.2507 488.8686 496.8311 562.8933 644.5347 681.4184 686.2033 697.5477 721.6936 783.0945 859.6823 931.2356 954.2302 963.8537 981.2255 1068.1526 1097.3920 1128.2531 1203.3303 1214.1747 1235.5503 1379.4958 1383.6836 1383.9062 1426.4084 1434.0496 1583.3827 1593.1875 3181.3696 3182.8741 3192.5948
redmass: 15.5888 15.8837 11.0487 15.4397 18.2050 4.8865 4.8416 16.3328 9.2895 12.6972 8.0976 5.6561 5.4195 10.1197 5.5805 4.2152 12.2740 11.3619 3.5004 8.6037 13.0565 11.4042 1.4920 1.3962 1.4604 6.3362 1.4261 1.4586 10.4983 14.4409 14.0289 1.2031 5.3111 9.2566 7.2291 5.4980 3.6365 7.8352 8.8730 1.0928 1.0940 1.0933
irintensity: 0.0151 0.0000 4.5846 0.2271 2.7808 2.5209 0.0001 1.8651 1.4409 0.6998 0.6899 0.0000 7.1211 2.7626 2.0740 4.7268 35.4466 61.6922 37.2031 0.0000 1.8258 28.5299 25.4800 0.0000 27.5933 4.5122 56.6727 2.6062 48.4747 325.2274 147.5770 0.0998 12.9284 35.1925 85.2858 20.3125 167.9335 6.7632 25.3554 17.2268 1.9210 27.1218
temp: 298.150 k
press: 1.00000 atm
elementType: 53 8 8 8 8 7 7 6 6 6 6 6 6 1 1 1
symmnumber: 1
zpe: 237476.4 jmol-1
zpe.correction: 0.090450 hartree
zpe.thermalcorrener: 0.101808 hartree
zpe.thermalcorrenthalpy: 0.102753 hartree
zpe.thermalcorrgfe: 0.050075 hartree
zpe.sumelectzpe: -651.237699 hartree
zpe.sumelectthermal: -651.226341 hartree
zpe.sumelectthermalent: -651.225397 hartree
zpe.sumelectthermalfe: -651.278074 hartree
dipole: -3.6943 0.0001 0.0012
dipole: 3.6943
quadrupole: -97.5955 -109.6781 -86.7419
quadrupole: 0.0009 0.0031 -0.0034
quadrupole: 0.4097 -11.6729 11.2633 0.0009 0.0031 -0.0034
hfenergy: -651.3281494 hartree
pointgroup: C01 [X(C6H3I1N2O4)]
dipole: -0.0000407 1.4534411 -0.0004533 debye
dipolederiv: 0.0474345 -0.0000688 0.0000302 0.0000024 -0.4634234 -0.0000212 0.0001236 -0.0002004 0.0662662 -0.5364314 -0.1698309 -0.0000044 -0.072344 -0.7785649 -0.0000572 0.0000043 0.0000334 -0.2052895 -0.5364342 0.1698296 -0.0000809 0.0723006 -0.7784757 -0.0001524 -0.0000607 0.0001515 -0.2053012 -0.8000105 0.0664784 -0.0000561 0.0246809 -0.5068485 0.0000114 0.0000683 -0.0000586 -0.2087091 -0.799993 -0.0665206 0.0000061 -0.0246305 -0.5067668 0.0000654 -0.000263 -0.00015 -0.2087255 1.5156128 0.3426041 0.0000231 0.2543629 1.1608609 0.0000317 0.0000169 0.0001195 0.183657 1.5155674 -0.3426383 0.000178 -0.2543815 1.1607389 0.0000412 0.0002195 0.0000714 0.1836847 -0.3391295 -0.24546 0.0000074 -0.1338493 -0.0786432 0.0000362 -0.0000408 -0.0001029 0.0846687 -0.3390792 0.2454121 -0.0000706 0.1338483 -0.0789072 0.0000466 0.000035 -0.0000519 0.0846493 0.1127342 0.0000775 0.0000337 0.0000055 -0.2366911 0.0000066 0.0000493 -0.0000802 -0.0713804 0.0379816 -0.0773829 0.0000266 0.1269643 -0.3678372 -0.0000326 -0.0000094 -0.0000296 -0.0288537 0.0379204 0.0774272 -0.0000356 -0.1269959 -0.3678293 -0.0000869 0.0000523 -0.0000722 -0.0288526 -0.3514691 -0.0000527 -0.0000277 0.0000278 1.3995907 0.0001149 -0.0001477 0.0003103 -0.1740805 0.1910369 0.0000132 -0.0000076 -0.0000003 0.1586374 -0.0000042 -0.0000177 0.0000365 0.1892576 0.1221296 0.0591708 -0.0000141 0.0186959 0.1420359 -0.0000062 -0.0000019 0.0000159 0.1695001 0.1221296 -0.0590587 -0.0000079 -0.0186872 0.1421235 0.0000067 -0.000028 0.0000073 0.1695091 unknown
polarizability: 141.7861266|-0.0005544|183.9260383|0.0110053|0.0067683|37.7615025 unknown
InChI: InChI=1S/C6H3IN2O4/c7-4-1-5(8(10)11)3-6(2-4)9(12)13/h1-3H
charge 0 multiplicity 1
16 atoms
I  0.000085 4.030431 0.000281
O  -2.443388 -2.236428 -0.000138
O  2.44336 -2.236558 0.000324
O  -3.576894 -0.252991 -0.000116
O  3.576934 -0.253232 0.000658
N  -2.49394 -0.950445 -0.000304
N  2.493923 -0.950583 0.000003
C  -1.195118 -0.209861 -0.000196
C  1.195124 -0.209925 -0.000062
C  -0.000016 -0.951334 -0.000205
C  -1.228107 1.200644 -0.000091
C  1.228164 1.200586 0.000068
C  0.000041 1.894947 0.000055
H  -0.000043 -2.044162 -0.00028
H  -2.193742 1.712858 -0.000088
H  2.193818 1.712755 0.00019
