program: Gaussian 09
title: 000235260
version: EM64L-G09RevD.01
frameworkgroup: C1[X(C16H14O6)]
method: RPBEPBE
basis: SDD
operation: Freq
keyword: #pfreq=noraman
keyword: PBEPBE/SDD
title: #p freq=noraman PBEPBE/SDD
converged: YES YES NO NO
title: Mulliken charges:
elementType: O O O O O O C C C C C C C C C C C C C C C C H H H H H H H H H H H H H H
charge: -0.398077 -0.398070 -0.245322 -0.245325 -0.431115 -0.431114 -0.372622 -0.372639 0.507546 0.507633 0.157461 0.157446 -0.406979 -0.407043 -0.350291 -0.350327 -0.389539 -0.389541 -0.360101 -0.360097 0.281589 0.281592 0.291336 0.291342 0.246858 0.246872 0.262466 0.262479 0.221619 0.221619 0.251222 0.251223 0.379135 0.379138 0.354812 0.354812
chargesum: 0.00000
title: Mulliken charges with hydrogens summed into heavy atoms:
elementType: O O O O O O C C C C C C C C C C C C C C C C
charge: -0.018942 -0.018932 -0.245322 -0.245325 -0.076303 -0.076302 -0.081286 -0.081296 0.507546 0.507633 0.157461 0.157446 -0.160120 -0.160171 -0.087825 -0.087848 -0.167920 -0.167922 -0.108878 -0.108875 0.281589 0.281592
polarizability: 2.75982912e+02 2.60011492e+01 1.33925863e+02 -2.67502899e+00 2.27742739e+01 1.65696974e+02
1716.lowfreq: -3.7520 -0.0010 -0.0007 -0.0004 2.5685 6.5306 23.1618 34.8047 42.9470
frequency: 23.1618 34.8047 42.9214 43.9681 49.9970 54.6984 75.3900 109.7300 118.4925 138.3678 163.0094 175.3393 193.4554 276.5247 289.5131 320.3237 348.6305 360.0567 362.9059 363.0787 399.5411 399.9878 412.1653 412.2652 436.6199 498.3184 508.3081 543.3134 543.8377 597.9393 601.0932 610.3719 621.1120 634.0709 644.3842 687.0001 689.5486 723.8334 730.9639 780.7705 800.6636 806.4090 807.4003 829.4716 838.7950 844.6062 868.7574 881.4943 933.3563 940.1997 959.1849 971.5422 972.4515 1005.5144 1005.8614 1021.2045 1059.7293 1075.8212 1105.5796 1110.2770 1143.3092 1144.7283 1184.0341 1185.3997 1191.9666 1196.7149 1218.1432 1232.5639 1233.9493 1250.7472 1250.7899 1291.0695 1323.2699 1337.8655 1340.2242 1357.0707 1394.4856 1396.3933 1431.0755 1431.6726 1502.0584 1502.6853 1596.1939 1596.5390 1624.5687 1625.2411 1645.3335 1651.4952 3060.0147 3072.9571 3116.5271 3116.5936 3137.5956 3137.6702 3152.5024 3152.5619 3171.7449 3171.7705 3504.6176 3504.8681 3582.0962 3582.2064
redmass: 6.6452 7.2085 5.6082 4.1299 5.0905 7.7294 10.2857 6.7522 8.6610 7.1367 6.5377 6.4398 6.7806 8.1940 6.9900 7.3470 5.7884 3.1387 1.3583 1.1356 3.9414 4.0300 2.9438 2.9401 5.2866 3.3759 3.2970 3.0271 2.9324 4.4781 1.7373 1.6955 3.8719 6.4262 5.9513 2.9562 3.1580 3.8896 3.9731 4.8946 5.7691 1.5151 1.4088 2.6807 1.5079 2.1166 4.0794 5.0272 1.4468 1.4245 3.4196 1.4037 1.3554 2.8759 2.7901 4.7927 2.0862 2.5056 1.4676 1.4877 1.3688 1.3662 1.1472 1.1786 2.0727 2.1600 1.3078 1.4595 1.6758 2.7632 2.7455 1.5317 1.5819 1.3431 1.7203 1.6463 5.6228 5.6370 2.6785 2.6908 2.6408 2.6688 6.3394 6.3367 6.3798 6.3980 8.5114 8.1602 1.0843 1.0850 1.0892 1.0891 1.0896 1.0897 1.0953 1.0953 1.0956 1.0956 1.0638 1.0638 1.0660 1.0660
irintensity: 0.8752 0.4576 0.0006 4.8365 0.0001 5.5537 0.0000 1.8244 0.7279 0.0000 0.0000 0.4713 0.0000 0.0000 5.9365 0.0000 7.3489 0.0001 0.1907 277.7516 0.0001 32.0118 0.2003 0.0002 1.1265 0.0000 7.3175 0.0165 157.9908 24.3599 0.0004 254.9879 0.0001 0.0000 9.5042 93.3704 0.0001 11.8848 0.0000 64.7370 0.0000 57.8666 0.0001 20.5801 0.0000 52.4381 0.0000 10.5439 0.0000 1.2697 0.0000 0.0003 1.3415 10.5371 0.0001 0.0000 476.5743 0.0001 110.7230 0.0000 474.9767 0.0001 28.0678 0.0000 0.0000 0.8285 16.4214 22.5077 0.0017 0.0104 71.6788 0.0000 50.3599 0.0033 138.5768 0.0000 0.0000 15.5038 19.1603 0.0002 0.0028 215.2056 0.0000 26.3694 0.0007 83.6430 311.4663 0.0000 0.0000 5.9683 41.5762 0.0003 0.0003 4.7977 0.1550 13.6070 9.6153 0.1438 52.8918 0.0016 94.5222 0.0692
temp: 298.150 k
press: 1.00000 atm
elementType: 8 8 8 8 8 8 6 6 6 6 6 6 6 6 6 6 6 6 6 6 6 6 1 1 1 1 1 1 1 1 1 1 1 1 1 1
symmnumber: 1
zpe: 703412.9 jmol-1
zpe.correction: 0.267916 hartree
zpe.thermalcorrener: 0.288228 hartree
zpe.thermalcorrenthalpy: 0.289172 hartree
zpe.thermalcorrgfe: 0.216746 hartree
zpe.sumelectzpe: -1067.881028 hartree
zpe.sumelectthermal: -1067.860716 hartree
zpe.sumelectthermalent: -1067.859772 hartree
zpe.sumelectthermalfe: -1067.932198 hartree
dipole: 0.0010 0.0003 -0.0005
dipole: 0.0011
quadrupole: -110.6388 -120.2262 -124.8316
quadrupole: 13.4010 18.2924 -1.8363
quadrupole: 7.9267 -1.6607 -6.2661 13.4010 18.2924 -1.8363
hfenergy: -1068.1489442 hartree
pointgroup: C01 [X(C16H14O6)]
dipole: -0.0003734 0.0001537 0.0001767 debye
polarizability: 274.6011383|-29.9282283|127.7341599|1.1157279|-14.5537044|173.2704512 unknown
InChI: InChI=1S/C16H14O6/c17-11-5-1-9(2-6-11)13(15(19)20)14(16(21)22)10-3-7-12(18)8-4-10/h1-8,13-14,17-19,21H
charge 0 multiplicity 1
36 atoms
O  -0.089831 2.858542 0.842362
O  0.088124 -2.86342 -0.84419
O  -0.142432 2.213209 -1.38485
O  0.141418 -2.218374 1.383084
O  6.086098 -0.333062 -0.345053
O  -6.087396 0.326962 0.345316
C  0.422981 0.547647 0.36412
C  -0.424292 -0.552536 -0.365511
C  1.933091 0.333835 0.189274
C  -1.9344 -0.339035 -0.190236
C  0.031379 1.91639 -0.180563
C  -0.032279 -1.921286 0.178846
C  2.722372 -0.072186 1.291198
C  -2.724047 0.067072 -1.291868
C  2.560672 0.506448 -1.073648
C  -2.561623 -0.512043 1.07281
C  4.106992 -0.302698 1.146013
C  -4.108673 0.297288 -1.146273
C  3.940626 0.280205 -1.232496
C  -3.941578 -0.286092 1.232068
C  4.714288 -0.124621 -0.120035
C  -4.715606 0.118827 0.119895
H  0.179447 0.523149 1.4389
H  -0.181018 -0.527834 -1.440345
H  2.249769 -0.225006 2.267285
H  -2.251726 0.220203 -2.268041
H  1.969197 0.835632 -1.935805
H  -1.96986 -0.841296 1.934744
H  4.704303 -0.620366 2.010501
H  -4.706268 0.615031 -2.010537
H  4.433916 0.413479 -2.19965
H  -4.434591 -0.419665 2.199321
H  -0.308045 3.747225 0.447968
H  0.306158 -3.752214 -0.449947
H  6.542892 -0.608233 0.48828
H  -6.544459 0.602222 -0.48784
